program: Gaussian 09
title: 000297449
version: EM64L-G09RevD.01
frameworkgroup: C1[X(C13H12BrN3O)]
method: RPBEPBE
basis: SDD
operation: Freq
keyword: #p
keyword: freq=noraman
keyword: PBEPBE/SDD
title: #p freq=noraman PBEPBE/SDD
converged: NO YES NO NO
title: Mulliken charges:
elementType: Br O N N N C C C C C C C C C C C C C H H H H H H H H H H H H
charge: 0.014136 -0.291301 -0.492223 -0.006258 -0.405771 0.457160 -0.071358 0.491975 -0.508553 -0.400737 -0.483870 -0.300649 -0.245421 -0.227877 0.314623 -0.468813 0.024646 -0.493125 0.230798 0.228666 0.314825 0.261857 0.287750 0.227862 0.231177 0.263191 0.234968 0.286939 0.239329 0.286055
chargesum: 0.00000
title: Mulliken charges with hydrogens summed into heavy atoms:
elementType: Br O N N N C C C C C C C C C C C C C
charge: 0.014136 -0.291301 -0.204473 -0.006258 -0.118831 0.457160 -0.071358 0.491975 -0.277756 -0.172071 -0.169045 -0.038793 -0.017559 0.003299 0.314623 0.029346 0.263974 -0.207070
polarizability: 3.02569468e+02 2.44976701e+01 1.56328356e+02 1.84268187e+01 -2.46726279e+01 1.30649561e+02
1716.lowfreq: -8.8167 -0.0008 -0.0007 0.0004 2.7285 3.4224 13.0214 16.5094 40.9206
frequency: 12.9723 16.4550 40.9018 65.6177 86.1615 98.1508 125.9734 157.6512 184.0664 197.2691 234.8863 247.5921 290.7938 319.6748 336.5538 364.4451 416.1202 419.7477 474.2788 480.8160 518.8645 528.1154 553.6407 591.6510 610.8062 656.7053 662.9333 704.3986 705.5492 744.0943 760.1152 761.1512 793.1563 793.7580 861.1574 869.8855 899.3728 915.8084 943.0407 948.9807 956.4744 965.7772 992.5685 993.2454 1015.7305 1052.5066 1094.2960 1117.8996 1163.3064 1182.3796 1197.5962 1212.0079 1224.0492 1258.5151 1268.3693 1277.5442 1297.7495 1340.5164 1355.7470 1365.2915 1391.4618 1428.9441 1443.0002 1450.7660 1471.4021 1479.3738 1526.4247 1555.8048 1602.7621 1624.4708 1625.5030 1645.7203 3020.8412 3094.7788 3101.8376 3116.9005 3127.9280 3136.5182 3153.3937 3170.6851 3184.2182 3190.2820 3510.3558 3550.4218
redmass: 11.8382 5.5887 6.2841 7.8305 2.1897 4.9339 4.7016 4.2750 3.9027 5.1767 6.2956 4.6430 2.7989 3.6353 2.8334 1.9057 4.7702 3.6820 2.9297 4.3781 7.4020 2.8721 5.3016 1.3874 7.5240 2.8590 3.3893 9.4871 5.7571 5.0301 1.4253 4.0111 2.6355 2.2416 1.3987 4.6367 1.8770 2.7680 1.3107 1.3759 3.0721 1.3829 1.3273 3.4692 2.1479 3.2556 3.5750 1.7682 1.1738 1.3270 1.6414 1.7250 1.7457 1.8850 1.2132 1.1933 2.0087 2.3636 1.2409 2.5237 3.4812 4.9181 1.2890 1.9093 2.2030 2.0363 2.5698 6.3856 5.6095 6.4484 6.4540 4.5709 1.0627 1.1001 1.0919 1.0873 1.0935 1.0892 1.0946 1.0993 1.0931 1.0963 1.0760 1.0777
irintensity: 0.1512 1.2319 1.5221 12.5153 0.7262 2.7200 2.3367 0.4957 0.7966 1.5074 7.7924 0.8356 5.1303 5.0125 25.6118 36.6015 7.4587 0.8486 5.3172 34.9482 0.8409 28.7811 1.6985 140.5442 4.7521 0.7697 48.5972 10.0781 18.2802 5.5413 43.8812 2.8976 22.5848 6.2432 27.6404 0.8898 34.7923 9.6423 92.7870 11.1858 21.4822 11.6859 0.1240 0.7639 6.8868 14.1552 29.9535 8.9439 5.1554 141.8789 5.4522 172.2445 85.6198 28.6303 151.0333 3.9678 97.0698 82.3944 7.0857 2.8264 149.8601 102.0710 75.2799 11.3632 13.5536 694.0301 228.6602 3.6030 171.9777 10.7172 60.2307 126.3940 46.4117 1.4493 21.4725 6.7160 10.4938 12.4391 25.4647 25.6742 3.4522 5.0041 4.3639 22.1432
temp: 298.150 k
press: 1.00000 atm
elementType: 35 8 7 7 7 6 6 6 6 6 6 6 6 6 6 6 6 6 1 1 1 1 1 1 1 1 1 1 1 1
symmnumber: 1
zpe: 594117.4 jmol-1
zpe.correction: 0.226287 hartree
zpe.thermalcorrener: 0.242833 hartree
zpe.thermalcorrenthalpy: 0.243778 hartree
zpe.thermalcorrgfe: 0.177902 hartree
zpe.sumelectzpe: -754.244786 hartree
zpe.sumelectthermal: -754.228240 hartree
zpe.sumelectthermalent: -754.227296 hartree
zpe.sumelectthermalfe: -754.293171 hartree
dipole: -0.5201 5.4572 -4.4029
dipole: 7.0312
quadrupole: -109.9775 -104.4338 -114.5199
quadrupole: 8.1054 7.3036 -8.1723
quadrupole: -0.3338 5.2099 -4.8761 8.1054 7.3036 -8.1723
hfenergy: -754.471073 hartree
pointgroup: C01 [X(C13H12Br1N3O1)]
dipole: 0.0082726 -2.7019181 -0.5931969 debye
polarizability: 307.6341801|-0.2734498|169.5231582|-4.4534121|7.2374737|112.3900472 unknown
InChI: InChI=1S/C13H12BrN3O/c14-6-3-7-15-13(18)17-11-8-10-4-1-2-5-12(10)16-9-11/h1-6,8-9,15,17H,7H2
charge 0 multiplicity 1
30 atoms
Br -6.135378 1.842817 -1.972866
O  -2.212642 0.466658 1.1574
N  -0.795092 -1.13926 0.147962
N  1.838417 1.460984 0.769251
N  -3.091205 -1.554587 0.391311
C  2.866631 -0.526977 -0.302056
C  2.953643 0.804877 0.261791
C  0.462848 -0.486363 0.189843
C  1.584727 -1.155355 -0.323842
C  4.056241 -1.147116 -0.808534
C  0.646982 0.841834 0.735173
C  4.218404 1.471311 0.302248
C  5.278892 -0.473281 -0.756652
C  5.362486 0.843743 -0.198463
C  -2.038825 -0.656396 0.599141
C  -4.468854 -1.144459 0.727736
C  -5.180771 -0.446787 -0.429087
C  -5.267134 0.899656 -0.492973
H  1.491172 -2.164371 -0.748462
H  3.994942 -2.155335 -1.23691
H  -0.214441 1.376654 1.140075
H  4.247945 2.476181 0.734786
H  -0.776324 -2.083947 -0.244188
H  6.185112 -0.95144 -1.145015
H  6.330124 1.356194 -0.166988
H  -4.398073 -0.467074 1.593841
H  -5.03471 -2.042293 1.034997
H  -2.960776 -2.399397 -0.166941
H  -5.601614 -1.072958 -1.226198
H  -4.846326 1.586186 0.24652
