program: Gaussian 09
title: 000027126
version: EM64L-G09RevD.01
frameworkgroup: C1[X(C4H7Cl3)]
method: RPBEPBE
basis: SDD
operation: Freq
keyword: #pfreq=noraman
keyword: PBEPBE/SDD
title: #p freq=noraman PBEPBE/SDD
converged: YES YES NO NO
title: Mulliken charges:
elementType: Cl Cl Cl C C C C H H H H H H H
charge: -0.006166 -0.006496 -0.060018 -0.249150 -0.317806 -0.569277 -0.580720 0.247662 0.247993 0.279179 0.279200 0.234706 0.234772 0.266122
chargesum: 0.00000
title: Mulliken charges with hydrogens summed into heavy atoms:
elementType: Cl Cl Cl C C C C
charge: -0.006166 -0.006496 -0.060018 0.246504 -0.317806 -0.010898 0.154880
polarizability: 7.93080098e+01 -3.30869988e-03 6.99918441e+01 3.56752492e+00 -1.08544815e-02 6.12410332e+01
1716.lowfreq: -5.9551 -0.0022 -0.0009 0.0017 6.9001 7.4008 50.0142 108.6992 131.6963
frequency: 50.0053 108.6873 131.6926 215.5211 239.1897 261.1184 273.9448 341.2460 347.8767 449.8489 516.7611 566.5329 697.8884 796.2590 911.2707 987.4696 1046.4978 1065.2441 1096.2506 1156.1585 1190.9173 1260.4013 1284.5648 1347.9920 1397.5298 1436.3463 1454.0987 1462.6287 1463.3898 2998.8473 3005.6139 3066.8765 3075.7740 3097.6099 3123.9073 3163.2607
redmass: 4.8392 2.9854 6.0024 10.2233 8.8016 1.5325 1.4719 3.4627 4.2789 5.4310 5.0764 3.6262 6.2903 1.1769 2.2039 1.3825 4.7476 1.3277 2.5636 1.3022 2.6864 1.2321 1.1324 1.4814 1.2009 1.0796 1.0501 1.0916 1.0434 1.0385 1.0566 1.1023 1.0563 1.1001 1.0999 1.1116
irintensity: 3.3634 0.3772 4.8241 1.8380 1.4211 0.0037 0.0006 6.0080 5.6131 7.5808 24.9696 85.6383 31.4168 24.8743 4.7842 0.0284 19.3776 36.1420 24.6122 45.4778 36.5956 15.4157 2.1951 21.0193 17.7354 4.3462 8.7612 10.6078 8.9376 2.4809 11.3664 2.5877 8.3745 11.6439 6.8778 5.0237
temp: 298.150 k
press: 1.00000 atm
elementType: 17 17 17 6 6 6 6 1 1 1 1 1 1 1
symmnumber: 1
zpe: 269693.4 jmol-1
zpe.correction: 0.102721 hartree
zpe.thermalcorrener: 0.111607 hartree
zpe.thermalcorrenthalpy: 0.112551 hartree
zpe.thermalcorrgfe: 0.067447 hartree
zpe.sumelectzpe: -1536.239715 hartree
zpe.sumelectthermal: -1536.230829 hartree
zpe.sumelectthermalent: -1536.229885 hartree
zpe.sumelectthermalfe: -1536.274989 hartree
dipole: -1.3357 -0.0007 2.0756
dipole: 2.4682
quadrupole: -71.8503 -65.0184 -60.1405
quadrupole: 0.0118 -4.2646 -0.0082
quadrupole: -6.1806 0.6513 5.5292 0.0118 -4.2646 -0.0082
hfenergy: -1536.3424354 hartree
pointgroup: C01 [X(C4H7Cl3)]
dipole: 0.5942692 -0.0744555 0.7643699 debye
dipolederiv: -0.2600563 -0.0788382 0.0282885 -0.066325 -0.6479861 0.1968133 0.0323037 0.2368418 -0.3108018 -0.2614748 0.0737827 0.0449554 0.0599727 -0.5498572 -0.2448009 0.0459726 -0.2852117 -0.4081907 -0.5914997 -0.005466 0.0376308 -0.012468 -0.1680548 0.0038677 0.1127988 0.0041396 -0.206025 -0.2126569 0.0035156 -0.0389026 -0.0144819 -0.1109084 0.0032016 0.1503157 0.0050677 -0.1576395 0.5710808 0.0063992 -0.0877884 0.0175979 1.3299211 0.051243 -0.1958426 0.050506 0.8205113 0.6932112 0.0164128 -0.1502063 0.0135701 0.1856582 -0.0008772 -0.1252194 -0.0005893 0.1873148 -0.1963027 0.0038367 -0.0454874 0.0048799 -0.1030978 0.004331 -0.0529503 0.00447 -0.1500734 0.0526851 -0.0270069 0.0302475 0.0113611 -0.0214284 0.0844755 -0.0228252 0.082429 0.0414866 0.0528424 0.0209901 0.0358819 -0.0066044 0.012342 -0.0894722 -0.0236585 -0.0881988 0.0084425 0.0098599 0.0221032 0.0608535 -0.0200775 0.0120247 -0.0844291 0.0093502 -0.0573864 0.0184449 0.0097844 -0.0328643 0.0549065 0.0179759 -0.014226 0.0789607 0.0126681 0.0513447 0.044301 0.1000936 -0.0381986 -0.005426 -0.0331373 -0.0416385 0.0907381 -0.0006707 0.0881204 0.0334393 0.0999718 0.0390786 0.0026348 0.0332066 -0.0038684 -0.0981086 0.0062809 -0.0954949 -0.0039355 -0.0675387 -0.0037449 0.0324119 -0.00547 0.1211195 0.004057 0.0514766 0.0039618 0.0827255 unknown
polarizability: 78.5561819|0.5503911|69.9131143|-5.0438976|0.7906339|62.071591 unknown
InChI: InChI=1S/C4H7Cl3/c1-4(6,7)2-3-5/h2-3H2,1H3
charge 0 multiplicity 1
14 atoms
Cl 1.239163 1.633962 -0.741323
Cl 1.249036 -1.416795 -1.047065
Cl -3.308588 -0.023781 0.229037
C  -0.551923 -0.048593 0.620887
C  0.917547 0.000006 0.180875
C  -1.574899 0.054693 -0.514486
C  1.931028 -0.110212 1.314235
H  -0.703538 -0.997916 1.168574
H  -0.711302 0.779029 1.337859
H  -1.509873 -0.787681 -1.216614
H  -1.517901 1.014371 -1.045909
H  1.791621 -1.067063 1.847735
H  1.787769 0.722549 2.025395
H  2.959561 -0.068868 0.9237
