program: Gaussian 09
title: 000297451
version: EM64L-G09RevD.01
frameworkgroup: C1[X(C11H15ClN2O)]
method: RPBEPBE
basis: SDD
operation: Freq
keyword: #p
keyword: freq=noraman
keyword: PBEPBE/SDD
title: #p freq=noraman PBEPBE/SDD
converged: YES YES NO NO
title: Mulliken charges:
elementType: Cl O N N C C C C C C C C C C C H H H H H H H H H H H H H H H
charge: -0.088037 -0.320093 -0.415987 -0.401477 -0.147607 0.410237 -0.721573 -0.370333 -0.414742 0.311075 -0.233329 -0.234212 -0.331316 -0.240149 -0.549646 0.264520 0.218973 0.201383 0.249816 0.289295 0.248321 0.245697 0.295612 0.240084 0.268302 0.226702 0.224750 0.229529 0.278716 0.265489
chargesum: 0.00000
title: Mulliken charges with hydrogens summed into heavy atoms:
elementType: Cl O N N C C C C C C C C C C C
charge: -0.088037 -0.320093 -0.126692 -0.105865 0.116913 0.410237 -0.051400 -0.122012 -0.169046 0.311075 -0.006627 -0.009462 0.177070 -0.010620 -0.005440
polarizability: 1.81444553e+02 8.68871585e+00 1.43636958e+02 1.36257982e+01 -6.30672020e-01 1.03519936e+02
1716.lowfreq: -6.2830 -1.4937 0.0022 0.0022 0.0024 5.8475 12.9345 20.0731 30.4385
frequency: 10.7983 19.7221 30.2771 57.0647 65.5982 95.3941 127.3028 162.7835 210.6462 236.0718 269.1725 282.7190 306.0384 344.2404 373.3221 403.6613 426.0924 458.0181 482.4406 534.3919 556.5246 577.2272 598.0309 616.8664 689.5135 705.7351 709.1996 749.0825 783.9503 848.3099 855.6762 891.7988 923.8409 967.6550 979.7698 985.8017 990.8435 996.4092 1018.6829 1039.0029 1043.3933 1068.6654 1098.3333 1115.4088 1152.6790 1173.0529 1188.4053 1190.6719 1212.5270 1215.9669 1239.8672 1291.9984 1301.7385 1318.4976 1346.3494 1370.1077 1383.5687 1386.7992 1436.6007 1436.9089 1439.7112 1453.0927 1475.2620 1481.9116 1484.7609 1503.1722 1592.3580 1614.0631 1621.2495 2983.3242 2991.0116 3006.2496 3049.4081 3063.5555 3079.4309 3097.4707 3121.3334 3128.2397 3141.0814 3151.6524 3152.4102 3164.6886 3541.1984 3549.6717
redmass: 4.9825 5.5572 3.8859 6.5002 6.6931 3.5745 3.5178 5.5228 3.1699 4.2043 5.3476 1.1003 1.9508 2.4776 1.5538 2.7964 3.1051 2.7518 3.2074 2.1237 1.7854 3.5111 3.9967 6.4114 4.4872 1.7954 9.5289 2.2226 2.2640 2.0015 1.2470 2.2195 1.3808 2.2213 1.3896 2.3919 5.6934 1.3160 2.3463 1.7109 1.8884 2.1716 2.1618 2.3467 1.5435 1.0510 2.1266 1.1278 1.7959 1.5472 1.4156 1.3965 1.3896 1.3032 1.2911 1.3119 5.9457 1.2492 2.1122 1.1860 1.1233 1.3710 1.0884 1.0872 2.1560 2.3625 6.0701 6.0424 5.1454 1.0372 1.0595 1.0820 1.0960 1.0627 1.0996 1.0994 1.0847 1.0875 1.0927 1.0952 1.1119 1.1011 1.0777 1.0770
irintensity: 0.4931 0.6672 0.2129 12.1795 3.8920 9.5006 4.0383 2.4740 0.4472 9.6187 2.6665 0.3834 11.6984 16.8653 7.0160 1.1829 12.9772 2.1156 4.5527 110.5735 136.4483 12.4356 42.3659 0.1940 9.2860 44.8334 8.6334 22.5114 40.5359 8.3666 0.0852 0.6110 2.8135 19.7560 0.2392 3.8758 0.1586 0.1684 24.5546 3.1771 2.3147 11.3466 25.7633 17.2612 1.6160 0.0613 15.8952 6.1175 8.0894 87.8636 165.2572 22.4988 45.5106 37.5374 14.6685 2.7810 3.4047 19.1267 13.8025 36.5401 28.6814 43.9512 7.6106 13.3580 10.4604 668.4466 1.2703 21.6732 164.1913 22.3131 57.8084 10.7987 6.5648 23.3002 34.4548 26.0265 2.6825 1.0757 23.3878 38.2009 18.1109 17.5500 14.3591 22.0552
temp: 298.150 k
press: 1.00000 atm
elementType: 17 8 7 7 6 6 6 6 6 6 6 6 6 6 6 1 1 1 1 1 1 1 1 1 1 1 1 1 1 1
symmnumber: 1
zpe: 641422.8 jmol-1
zpe.correction: 0.244305 hartree
zpe.thermalcorrener: 0.259890 hartree
zpe.thermalcorrenthalpy: 0.260834 hartree
zpe.thermalcorrgfe: 0.197264 hartree
zpe.sumelectzpe: -1071.852830 hartree
zpe.sumelectthermal: -1071.837245 hartree
zpe.sumelectthermalent: -1071.836301 hartree
zpe.sumelectthermalfe: -1071.899871 hartree
dipole: -0.7488 -0.6006 -1.6984
dipole: 1.9509
quadrupole: -89.1400 -100.0973 -97.3733
quadrupole: 4.9540 6.2979 -7.3135
quadrupole: 6.3969 -4.5604 -1.8365 4.9540 6.2979 -7.3135
hfenergy: -1072.097135 hartree
pointgroup: C01 [X(C11H15Cl1N2O1)]
dipole: 0.2118562 0.3901524 -0.6261162 debye
polarizability: 176.9786207|11.7598768|139.5016424|-22.2014667|9.4203639|112.1211838 unknown
InChI: InChI=1S/C11H15ClN2O/c1-9(10-5-3-2-4-6-10)14-11(15)13-8-7-12/h2-6,9,13-14H,7-8H2,1H3
charge 0 multiplicity 1
30 atoms
Cl -4.801341 2.129009 0.577017
O  -1.563164 -1.957208 0.949164
N  -0.459257 -0.558528 -0.569324
N  -2.754045 -0.259796 -0.142663
C  0.846801 -1.240651 -0.415509
C  1.963266 -0.187813 -0.332345
C  1.042178 -2.320757 -1.501527
C  1.863836 0.832857 0.651685
C  3.095387 -0.196043 -1.183513
C  -1.586969 -0.984936 0.125995
C  2.864639 1.818037 0.780465
C  4.100827 0.792518 -1.058923
C  -4.007487 -0.577216 0.53744
C  3.990159 1.802537 -0.078456
C  -4.454235 0.508306 1.517301
H  0.772236 -1.759503 0.560322
H  1.971326 -2.894043 -1.330077
H  1.083681 -1.881309 -2.515464
H  0.194931 -3.025858 -1.462351
H  -0.525102 0.185974 -1.265526
H  0.991504 0.846922 1.31615
H  3.203439 -0.973136 -1.947268
H  -2.733455 0.578078 -0.726519
H  -4.81327 -0.770571 -0.196131
H  -3.825961 -1.509827 1.10605
H  2.771819 2.594438 1.548355
H  4.969434 0.770666 -1.727016
H  4.769664 2.566574 0.018231
H  -3.67367 0.761969 2.248711
H  -5.404575 0.258611 2.012425
