program: Gaussian 09
title: 000297382
version: EM64L-G09RevD.01
frameworkgroup: C1[X(C7H7BrO2)]
method: RPBEPBE
basis: SDD
operation: Freq
keyword: #p
keyword: freq=noraman
keyword: PBEPBE/SDD
title: #p freq=noraman PBEPBE/SDD
converged: NO YES NO NO
title: Mulliken charges:
elementType: Br O O C C C C C C C H H H H H H H
charge: 0.035270 -0.265540 -0.417448 0.335526 -0.323320 -0.328123 0.413666 -0.348686 -0.351274 -0.536216 0.273788 0.244831 0.221287 0.247664 0.220217 0.220217 0.358138
chargesum: 0.00000
title: Mulliken charges with hydrogens summed into heavy atoms:
elementType: Br O O C C C C C C C
charge: 0.035270 -0.265540 -0.059310 0.335526 -0.049532 -0.083292 0.413666 -0.348686 -0.129986 0.151883
polarizability: 1.49917316e+02 -1.09804666e+00 1.03074869e+02 4.70426632e-04 -2.50308733e-03 4.20808373e+01
1716.lowfreq: -6.1357 -4.7898 -0.0010 -0.0007 -0.0002 8.2696 78.5890 122.6338 153.6753
frequency: 78.5685 122.6290 153.6752 181.8049 221.6800 243.6589 263.4307 313.3289 361.9937 390.9009 435.6034 451.3020 535.9940 576.4414 663.8525 703.3260 716.4649 780.6226 839.8188 874.1001 895.4107 997.1592 1012.8703 1106.7824 1113.2037 1149.8682 1166.8913 1205.0307 1262.8096 1274.1959 1381.3361 1412.4661 1437.1675 1467.8169 1473.6617 1490.8341 1580.1274 1617.7325 2956.1517 3042.5652 3119.1908 3126.7534 3170.6510 3178.6718 3586.6042
redmass: 3.3309 4.8710 7.4497 4.6771 5.0220 1.1505 6.0397 1.1105 6.0787 6.9699 3.0954 4.6308 4.4393 3.4640 7.3139 3.4844 6.4168 1.4859 7.2903 1.5276 1.3423 8.9502 2.7874 1.5033 1.2589 1.3199 1.2152 2.3477 2.1859 1.9423 5.2128 4.3578 1.2052 1.0500 1.0833 2.5432 7.3851 7.0207 1.0332 1.1039 1.0897 1.0990 1.0936 1.0928 1.0661
irintensity: 7.0491 2.5203 1.4935 0.4333 1.0418 0.0405 4.0458 140.4718 1.4760 4.0091 13.9438 15.9245 0.3599 8.0372 5.6732 0.1561 54.7937 56.3054 11.4341 25.3940 2.3482 122.9049 15.6350 179.9685 0.1759 63.2196 14.9778 49.6555 39.1043 88.0577 44.8853 27.1718 9.6056 13.8630 59.9764 187.4069 24.1797 32.4839 67.8861 51.7211 18.9726 19.1802 8.7551 0.6223 40.4544
temp: 298.150 k
press: 1.00000 atm
elementType: 35 8 8 6 6 6 6 6 6 6 1 1 1 1 1 1 1
symmnumber: 1
zpe: 323800.1 jmol-1
zpe.correction: 0.123329 hartree
zpe.thermalcorrener: 0.133187 hartree
zpe.thermalcorrenthalpy: 0.134131 hartree
zpe.thermalcorrgfe: 0.087248 hartree
zpe.sumelectzpe: -434.084475 hartree
zpe.sumelectthermal: -434.074617 hartree
zpe.sumelectthermalent: -434.073673 hartree
zpe.sumelectthermalfe: -434.120556 hartree
dipole: -4.0784 2.9508 -0.0002
dipole: 5.0339
quadrupole: -57.1583 -56.3971 -71.2500
quadrupole: -2.4000 -0.0002 -0.0009
quadrupole: 4.4435 5.2047 -9.6482 -2.4000 -0.0002 -0.0009
hfenergy: -434.2078039 hartree
pointgroup: C01 [X(C7H7Br1O2)]
dipole: -1.2177302 1.5618864 -0.0000768 debye
dipolederiv: -0.3944908 0.2671582 -0.0000031 0.3509477 -0.2765324 0.0000104 -0.0000813 0.0000584 -0.0162707 -1.7373151 -0.0814783 0.0000183 -0.2696769 -0.3557754 0.0000054 -0.0001089 0.0000941 -0.2966344 -1.1893981 -0.5596094 0.0000358 -0.5115002 -0.2356268 -0.0000193 0.0001898 -0.0001556 -0.398901 1.3458128 0.2915519 -0.0000267 0.5962696 0.0787284 -0.0000073 0.0000809 -0.0000832 0.0786461 -0.4504487 -0.0775033 -0.0000049 0.2891432 -0.0672687 -0.0000153 -0.0001257 0.0000843 -0.1029628 -0.2231043 0.1614754 0.0000013 -0.3476763 -0.0069415 -0.0000098 -0.0000111 0.0000077 -0.193416 0.8239168 0.7944249 -0.0000355 0.5792331 -0.0159783 0.0000014 -0.0001698 0.0001064 0.0801692 0.6643327 -0.4290867 0.000018 -0.7817518 0.5421111 -0.0000161 0.0002411 -0.0001697 -0.1448075 -0.0346944 -0.3592547 0.0000114 0.188285 0.0493544 -0.0000091 0.0000052 -0.0000141 -0.1784529 0.7919297 -0.0793956 -0.0000036 -0.4076628 0.2737431 0.0000036 0.0001315 -0.0000809 0.33332 0.1150918 -0.024487 0.000003 -0.0209896 0.0030659 0.0000143 0.0000205 -0.0000059 0.1703647 -0.0265007 0.0904771 -0.0000059 0.101029 0.0351972 0.0000085 -0.0000009 0.0000039 0.1726022 0.0292893 -0.0577283 0.0000039 -0.0497501 -0.1097843 0.000013 0.0000456 -0.0000206 0.1719092 -0.1033167 -0.0737682 0.0000017 -0.1260258 0.0277251 0.0000036 0.0000241 -0.0000074 0.1249316 0.016948 -0.0122572 0.0336902 0.1566602 -0.0178239 0.1214341 -0.0353358 0.1080542 -0.0934295 0.0169235 -0.012245 -0.0336875 0.1566805 -0.0178554 -0.1214379 0.035166 -0.1079531 -0.0934164 0.3550241 0.1617262 -0.0000163 0.0967851 0.0936615 0.0000205 -0.0000713 0.0000814 0.3863483 unknown
polarizability: 145.6964557|-13.4575434|107.2957297|-0.0002453|-0.0025351|42.0808373 unknown
InChI: InChI=1S/C7H7BrO2/c1-10-5-2-3-7(9)6(8)4-5/h2-4,9H,1H3
charge 0 multiplicity 1
17 atoms
Br 2.691782 -1.88622 0.00009
O  -2.476648 -0.82745 0.000115
O  2.79051 1.190984 0.000006
C  -1.209598 -0.221356 0.000084
C  -0.115456 -1.124282 0.0001
C  -0.973772 1.173692 0.000038
C  1.455171 0.764238 0.000025
C  1.19738 -0.632051 0.00007
C  0.356114 1.65199 0.000012
C  -3.642959 0.057608 0.000103
H  -0.317657 -2.198387 0.000135
H  -1.798027 1.891678 0.000026
H  0.537735 2.734561 -0.000019
H  -4.513099 -0.614878 0.000133
H  -3.664863 0.695749 -0.905371
H  -3.664842 0.695801 0.905541
H  2.841431 2.178824 -0.000087
