program: Gaussian 09
title: 000297395
version: EM64L-G09RevD.01
frameworkgroup: C1[X(C17H20O4)]
method: RPBEPBE
basis: SDD
operation: Freq
keyword: #pfreq=noraman
keyword: PBEPBE/SDD
title: #p freq=noraman PBEPBE/SDD
converged: YES YES NO NO
title: Mulliken charges:
elementType: O O O O C C C C C C C C C C C C C C C C C H H H H H H H H H H H H H H H H H H H H
charge: -0.442176 -0.441909 -0.443847 -0.441982 -0.350796 -0.398888 -0.399543 -0.535337 -0.529733 0.461588 0.438974 0.089892 0.097809 -0.589588 -0.546206 0.293406 0.292554 -0.359866 -0.359056 -0.351925 -0.383758 0.189944 0.192350 0.233961 0.203729 0.231630 0.207352 0.198885 0.225552 0.222550 0.203894 0.229131 0.260560 0.214571 0.212543 0.250110 0.218253 0.352784 0.351497 0.350782 0.350310
chargesum: 0.00000
title: Mulliken charges with hydrogens summed into heavy atoms:
elementType: O O O O C C C C C C C C C C C C C C C C C
charge: -0.089392 -0.090413 -0.093065 -0.091672 0.031498 0.038801 0.039439 -0.110901 -0.103289 0.461588 0.438974 0.089892 0.097809 -0.360456 -0.285647 0.293406 0.292554 -0.145295 -0.146512 -0.101815 -0.165505
polarizability: 2.51996166e+02 -2.16221397e+01 2.09591665e+02 -1.63925585e+00 1.09155611e+00 1.37810458e+02
1716.lowfreq: -4.5723 -0.0005 -0.0003 0.0003 3.2356 4.8262 13.0698 15.8778 26.3474
frequency: 12.9703 15.7775 26.3468 38.7872 70.7179 88.3505 114.1247 126.9271 132.6844 142.1700 144.2469 189.0614 257.4834 276.3408 284.2198 299.6134 314.0283 315.9469 317.4468 326.1640 331.9922 352.3280 356.3357 375.2239 392.6272 444.0059 445.0825 460.3211 470.1654 483.8742 485.0898 572.3594 576.8828 615.2837 630.1730 708.7358 710.7100 728.5561 730.1939 737.1110 744.5731 758.6829 768.2922 777.2987 797.5839 831.0847 853.5450 876.3931 889.6682 913.2928 927.9500 937.1151 949.5115 991.7984 1034.4025 1056.3296 1057.4528 1071.6188 1073.1421 1094.6692 1114.7437 1131.9209 1140.1924 1150.8448 1156.3150 1180.8692 1182.4990 1220.5793 1223.6479 1227.0492 1233.3882 1266.7765 1268.4816 1271.7496 1284.4966 1289.3966 1291.7131 1306.3799 1317.1110 1324.1520 1342.6141 1350.6652 1399.0822 1401.8070 1429.9312 1455.6350 1462.3783 1465.3741 1466.2941 1476.3080 1487.3551 1494.1204 1507.8099 1607.1999 1615.3045 1625.8997 1631.0722 2950.9455 2974.9342 2978.8352 2984.9377 2989.1160 2996.8697 3028.2348 3034.3904 3055.1924 3063.2606 3103.8515 3109.1837 3115.0811 3133.2827 3154.4871 3175.6319 3585.2172 3586.4291 3586.7023 3587.5905
redmass: 6.1208 5.9504 5.1122 5.3370 3.6438 2.7848 2.0211 5.2471 4.9381 2.1674 6.0766 5.2494 3.8433 2.7762 2.7782 4.6032 1.1082 1.1020 1.1278 1.1244 4.8223 6.0329 5.3869 4.7435 3.5158 4.3221 5.6892 3.9611 2.9226 3.9044 3.6809 3.5783 4.0131 4.4324 4.7536 4.9321 4.8507 2.2346 2.4796 1.7123 2.3737 3.6158 1.6992 1.5840 1.4966 1.3873 1.5705 1.4001 1.4540 1.3446 2.3943 3.8035 1.8043 4.5458 3.3684 4.4042 2.0375 2.0891 2.3192 1.6284 1.2272 1.6378 1.3911 1.1971 1.1996 1.5740 1.3425 1.6588 1.2538 2.0252 1.7584 1.6864 2.2258 2.2616 1.4662 1.0913 1.2524 1.2310 1.3701 1.5213 1.4327 1.5891 5.7312 6.1428 3.3428 2.0422 1.1869 1.1920 1.1524 1.1205 1.1044 2.8081 2.8876 6.8179 7.0671 6.5721 6.7903 1.0587 1.0611 1.0597 1.0620 1.0602 1.0952 1.0982 1.1014 1.1049 1.1045 1.0911 1.0870 1.0900 1.0969 1.0922 1.0948 1.0660 1.0659 1.0661 1.0661
irintensity: 0.2768 0.0967 0.6540 0.3117 1.8387 0.4446 0.2119 0.2237 0.7075 0.0677 0.0410 7.5496 9.2205 4.0843 3.0003 6.1878 65.2341 51.9151 200.7742 205.7126 14.9979 2.2701 2.2857 4.6454 2.6203 8.3416 2.8940 12.4574 23.5074 12.5437 3.5845 4.5183 12.1123 3.6315 3.2639 24.4721 9.9418 9.5655 3.8557 50.3445 0.1591 5.0696 1.3929 56.0690 42.8732 19.5536 27.3968 4.8089 14.1449 0.1454 0.9621 12.5222 6.7288 4.4463 0.3349 3.1240 21.2120 14.1167 2.4846 177.6413 9.3744 211.3462 253.8818 131.7989 42.5777 5.8121 6.8202 0.8585 38.7943 1.1714 39.5434 6.4084 0.4078 6.7641 8.2695 5.2752 17.4929 39.1764 1.0953 1.5112 1.5684 0.0249 37.0993 12.4428 103.2344 14.6205 2.6460 1.7673 0.9048 0.6127 19.9290 133.9962 72.3567 11.8614 18.1952 7.2384 15.6831 24.2952 4.2245 0.5440 29.4760 102.2115 10.6770 1.9910 0.2383 0.9455 93.8133 20.1147 19.0249 14.4341 19.3988 3.2204 5.7891 41.9311 56.4884 14.6408 3.5806
temp: 298.150 k
press: 1.00000 atm
elementType: 8 8 8 8 6 6 6 6 6 6 6 6 6 6 6 6 6 6 6 6 6 1 1 1 1 1 1 1 1 1 1 1 1 1 1 1 1 1 1 1 1
symmnumber: 1
zpe: 870284.4 jmol-1
zpe.correction: 0.331474 hartree
zpe.thermalcorrener: 0.352671 hartree
zpe.thermalcorrenthalpy: 0.353615 hartree
zpe.thermalcorrgfe: 0.278666 hartree
zpe.sumelectzpe: -959.133707 hartree
zpe.sumelectthermal: -959.112510 hartree
zpe.sumelectthermalent: -959.111566 hartree
zpe.sumelectthermalfe: -959.186514 hartree
dipole: 2.0804 1.5588 -1.3260
dipole: 2.9182
quadrupole: -114.4348 -104.8847 -125.2215
quadrupole: 14.3574 -14.4662 3.4976
quadrupole: 0.4122 9.9623 -10.3745 14.3574 -14.4662 3.4976
hfenergy: -959.4651809 hartree
pointgroup: C01 [X(C17H20O4)]
dipole: 0.8351683 0.5560958 -0.5580573 debye
polarizability: 250.7034377|-22.8776999|210.7478736|-0.3646411|-3.3131955|137.9469779 unknown
InChI: InChI=1S/C17H20O4/c18-14-6-8-16(20)12(10-14)4-2-1-3-5-13-11-15(19)7-9-17(13)21/h6-11,18-21H,1-5H2
charge 0 multiplicity 1
41 atoms
O  -3.504932 -2.372795 0.315127
O  3.542188 2.42779 -0.016868
O  -6.561536 2.202564 -0.916231
O  6.452855 -2.371011 -0.530889
C  0.010883 0.111749 1.304153
C  -1.277389 0.05106 0.454483
C  1.297512 0.076602 0.450657
C  -2.564307 0.098966 1.325501
C  2.58576 0.119834 1.319864
C  -3.836968 0.010845 0.503442
C  3.856515 0.086228 0.490931
C  -4.286514 -1.23669 -0.006842
C  4.314025 1.25249 -0.186275
C  -4.602354 1.160735 0.19707
C  4.608085 -1.099325 0.343387
C  -5.774333 1.076386 -0.592129
C  5.7766 -1.134205 -0.45171
C  -5.458838 -1.326623 -0.791807
C  5.480993 1.226572 -0.978508
C  -6.209083 -0.170002 -1.089138
C  6.220991 0.029607 -1.116762
H  0.006505 1.035773 1.920492
H  0.01659 -0.739635 2.017135
H  -1.287025 -0.881339 -0.141645
H  -1.29127 0.894218 -0.265348
H  1.308705 0.937624 -0.244614
H  1.307858 -0.841089 -0.171109
H  -2.565695 1.035402 1.917139
H  -2.527045 -0.745382 2.039912
H  2.561175 1.046034 1.925568
H  2.577942 -0.737385 2.020313
H  -4.269654 2.132505 0.587821
H  4.292288 -2.016521 0.850945
H  -5.79427 -2.299278 -1.175334
H  5.822672 2.134967 -1.491746
H  -7.118257 -0.219479 -1.69446
H  7.128207 0.0144 -1.733872
H  -3.920415 -3.191776 -0.051265
H  3.960207 3.186753 -0.49333
H  -6.1730 3.022777 -0.523608
H  7.254531 -2.293148 -1.104651
