program: Gaussian 09
title: 000297369
version: EM64L-G09RevD.01
frameworkgroup: C1[X(C12H12N2O2)]
method: RPBEPBE
basis: SDD
operation: Freq
keyword: #p
keyword: freq=noraman
keyword: PBEPBE/SDD
title: #p freq=noraman PBEPBE/SDD
converged: YES YES NO NO
title: Mulliken charges:
elementType: O O N N C C C C C C C C C C C C H H H H H H H H H H H H
charge: -0.277707 -0.277707 -0.022384 -0.022380 0.343147 0.343144 0.171522 0.171523 -0.534313 -0.534311 -0.507432 -0.507432 -0.532603 -0.532603 -0.166815 -0.166820 0.269203 0.269203 0.277080 0.277026 0.277080 0.277027 0.228922 0.228888 0.245465 0.228888 0.245465 0.228922
chargesum: 0.00000
title: Mulliken charges with hydrogens summed into heavy atoms:
elementType: O O N N C C C C C C C C C C C C
charge: -0.277707 -0.277707 -0.022384 -0.022380 0.343147 0.343144 0.171522 0.171523 -0.265111 -0.265108 0.046675 0.046676 0.170672 0.170672 -0.166815 -0.166820
polarizability: 1.80023685e+02 1.40095625e+01 1.77093237e+02 7.81674346e-05 1.42243872e-04 7.57840878e+01
1716.lowfreq: -12.3750 -9.5303 -2.1147 -0.0002 0.0002 0.0005 26.5960 42.4917 57.8654
frequency: 26.5960 42.4887 57.8654 90.4081 99.4522 111.7375 127.4542 163.9513 178.5909 185.6058 209.3339 243.1672 248.9731 266.8845 300.3295 353.8548 358.7595 372.6267 387.3276 417.7829 451.8171 451.9237 535.8329 568.2936 625.9225 630.9929 648.1760 736.3271 745.5828 844.1486 854.6134 863.3041 939.3457 939.9492 940.2575 948.0036 958.8911 1000.1077 1082.0789 1113.1664 1113.3246 1149.2088 1158.2257 1161.2676 1196.4203 1196.8380 1197.1680 1259.7132 1291.6541 1302.1894 1313.0996 1383.4703 1404.9647 1431.8259 1433.0557 1441.2426 1451.5044 1466.7302 1466.7486 1470.3357 1473.7708 1513.0878 1599.8925 1628.2381 2202.4688 2202.5769 2966.1527 2966.8234 2989.5456 2989.5978 3031.9494 3032.0213 3057.0341 3057.1076 3128.7087 3128.7579 3159.9080 3162.2660
redmass: 8.9003 3.4724 2.9558 9.9357 7.7622 3.6409 2.9387 2.6345 3.5957 4.8392 1.2417 6.8405 1.3030 2.1690 4.2061 3.3751 3.3562 8.5113 6.7899 4.9844 7.1353 2.9848 7.7047 5.2064 5.5722 4.7270 5.1362 2.9421 6.1589 4.5680 1.4515 1.5083 6.4345 2.1501 1.9339 4.2189 5.4230 6.6317 4.3317 1.2602 1.2601 2.4852 1.5538 1.4561 1.0929 1.0929 1.9158 1.3912 1.8643 3.6227 1.6150 6.0715 2.7790 1.0870 1.1198 1.1810 1.4461 1.0493 1.0492 1.1006 1.0503 2.8641 9.7770 6.4940 12.4651 12.4590 1.0325 1.0327 1.0597 1.0597 1.0978 1.0979 1.1043 1.1043 1.1002 1.1001 1.0905 1.0910
irintensity: 10.1600 0.0001 1.6499 10.9956 0.0001 0.0000 30.9834 1.9375 2.8076 0.0000 0.0000 0.6691 0.3951 0.0000 0.0000 0.0000 1.5798 0.0000 0.0000 14.2112 0.0505 6.3910 0.8529 0.0000 37.7672 0.7749 0.0000 0.0000 0.0000 18.4079 0.0001 37.3478 0.0002 0.0001 13.0832 4.2559 0.0000 125.2259 0.0000 0.0246 0.0000 13.6631 36.1061 0.0000 0.0345 0.4311 237.9479 0.0000 31.4978 0.0000 0.0000 76.8331 14.0962 0.0001 77.3682 0.0000 72.4512 29.3680 0.0221 118.7432 0.0001 102.5151 0.0000 0.0000 24.1574 0.0001 112.5751 0.0009 0.0038 10.8797 1.8467 0.0005 0.1227 78.9685 42.2944 0.4204 3.9432 0.0000
temp: 298.150 k
press: 1.00000 atm
elementType: 8 8 7 7 6 6 6 6 6 6 6 6 6 6 6 6 1 1 1 1 1 1 1 1 1 1 1 1
symmnumber: 1
zpe: 560455.4 jmol-1
zpe.correction: 0.213466 hartree
zpe.thermalcorrener: 0.229893 hartree
zpe.thermalcorrenthalpy: 0.230837 hartree
zpe.thermalcorrgfe: 0.168442 hartree
zpe.sumelectzpe: -723.212762 hartree
zpe.sumelectthermal: -723.196336 hartree
zpe.sumelectthermalent: -723.195392 hartree
zpe.sumelectthermalfe: -723.257787 hartree
dipole: -0.0001 0.0001 0.0065
dipole: 0.0065
quadrupole: -133.4198 -72.3672 -93.5060
quadrupole: -7.4322 -0.0002 0.0000
quadrupole: -33.6554 27.3971 6.2583 -7.4322 -0.0002 0.0000
hfenergy: -723.4262285 hartree
pointgroup: C01 [X(C12H12N2O2)]
dipole: -0.0000308 0.0000034 0.0025491 debye
polarizability: 164.653113|2.2485845|192.4638049|0.0186311|-0.0046082|75.7840919 unknown
InChI: InChI=1S/C12H12N2O2/c1-15-11-7-10(4-6-14)12(16-2)8-9(11)3-5-13/h7-8H,3-4H2,1-2H3
charge 0 multiplicity 1
28 atoms
O  -2.241934 1.700571 -0.556497
O  2.241751 -1.700734 -0.555399
N  -3.06085 -3.624764 -0.557994
N  3.060728 3.624593 -0.557011
C  -1.331821 -0.504964 -0.555913
C  1.331638 0.5048 -0.555401
C  -1.088324 0.893418 -0.556057
C  1.088141 -0.893581 -0.55552
C  -0.235576 -1.390984 -0.5556
C  0.235393 1.39082 -0.555628
C  -2.785518 -0.97559 -0.555927
C  2.785335 0.975426 -0.554849
C  -2.051398 3.154791 -0.556732
C  2.051215 -3.154954 -0.555575
C  -2.942565 -2.437579 -0.557274
C  2.942382 2.437414 -0.556255
H  -0.428931 -2.467727 -0.555399
H  0.428747 2.467563 -0.55544
H  -3.312762 -0.555497 -1.43463
H  -3.312155 -0.557425 0.324093
H  3.312946 0.555259 -1.433296
H  3.311604 0.557335 0.325426
H  -1.506738 3.486925 -1.461155
H  -1.507175 3.487156 0.347883
H  -3.06626 3.578211 -0.557112
H  1.50661 -3.487232 0.348842
H  3.066078 -3.578375 -0.555484
H  1.506939 -3.487177 -1.460195
