program: Gaussian 09
title: 000297365
version: EM64L-G09RevD.01
frameworkgroup: C1[X(C11H15BrO2)]
method: RPBEPBE
basis: SDD
operation: Freq
keyword: #p
keyword: freq=noraman
keyword: PBEPBE/SDD
title: #p freq=noraman PBEPBE/SDD
converged: YES YES NO NO
title: Mulliken charges:
elementType: Br O O C C C C C C C C C C C H H H H H H H H H H H H H H H
charge: 0.003184 -0.284255 -0.279043 0.259380 0.271225 -0.120477 0.466713 0.260110 -0.608908 -0.837027 -0.833384 -0.845490 -0.523085 -0.518652 0.269476 0.229272 0.227191 0.227319 0.270468 0.229169 0.245480 0.251501 0.263228 0.234238 0.225770 0.223759 0.236815 0.220442 0.235581
chargesum: 0.00000
title: Mulliken charges with hydrogens summed into heavy atoms:
elementType: Br O O C C C C C C C C C C C
charge: 0.003184 -0.284255 -0.279043 0.259380 0.271225 -0.120477 0.466713 0.260110 -0.608908 -0.111087 -0.106428 -0.085282 0.160682 0.174186
polarizability: 1.89391340e+02 -4.68665254e+00 1.66396270e+02 -5.39121839e-01 -1.54600014e+00 8.14074848e+01
1716.lowfreq: -10.1817 -9.0357 0.0000 0.0002 0.0003 4.6209 50.6620 67.4297 75.1282
frequency: 50.5629 67.4134 75.0345 96.4089 121.2903 133.5306 140.0876 145.6449 152.7010 169.5559 171.5150 180.5993 209.3724 236.9756 293.3777 314.6346 321.3875 326.7481 341.3242 364.2312 406.2204 466.5555 518.0612 558.6794 574.5129 626.0957 683.2256 717.2765 775.6824 812.5607 895.6243 955.2883 959.0617 1014.3230 1022.7717 1036.4899 1043.6692 1053.9025 1077.6847 1081.6788 1108.6017 1113.0839 1150.6565 1152.0135 1197.5226 1308.3499 1334.9244 1370.7083 1385.5222 1392.8338 1396.3866 1421.7249 1434.3660 1443.2164 1451.6881 1458.2061 1458.9061 1463.6042 1466.9806 1470.0627 1471.7118 1480.0774 1484.0822 1490.1628 1558.8917 1584.6917 2957.4268 2962.9324 2973.4629 2974.5755 2985.0086 3043.9014 3047.1449 3051.7222 3055.3220 3060.8584 3105.5784 3107.4149 3111.7247 3112.7929 3118.7513
redmass: 2.7100 3.5462 2.4278 3.2512 1.8841 1.3571 1.8853 1.3486 1.2172 1.2804 1.1247 2.4942 3.3511 7.9959 3.2336 2.7148 3.6665 3.8674 3.4637 6.6392 7.1606 5.0451 5.3215 4.9744 4.0670 3.6436 5.7733 5.2580 4.7499 4.3987 5.2684 2.8045 4.5857 1.9300 1.4085 1.7749 1.5057 1.5934 2.5611 3.7557 1.2476 1.2474 1.3977 1.4172 6.5536 7.7337 6.8698 3.9436 1.2351 1.2290 1.1910 3.2789 1.3213 1.2820 1.1782 1.0544 1.0572 1.0956 1.0837 1.0933 1.0783 1.0561 1.0512 1.0489 5.8720 8.0632 1.0312 1.0318 1.0401 1.0406 1.0387 1.1035 1.0954 1.0948 1.1033 1.0963 1.0975 1.0971 1.0998 1.0992 1.1013
irintensity: 5.4307 2.1076 0.8945 1.8224 0.0561 1.3699 5.1008 0.7809 0.4294 1.9158 0.5567 0.8369 0.2836 0.8123 1.4082 0.6854 0.3052 6.6760 5.5414 20.9077 0.1924 1.9152 1.5718 6.3816 0.4031 0.1438 2.7882 38.4714 0.3161 17.5865 7.3994 36.8430 89.1968 27.0618 5.0841 39.5710 2.7806 0.6676 72.7062 28.0384 0.6519 0.1294 6.5467 2.9295 65.9747 24.4179 9.5581 98.8262 2.3588 28.6866 9.4047 5.4648 0.2089 20.2209 6.2423 12.0226 10.8465 4.0999 10.0485 73.7599 11.9370 3.1495 0.8818 34.0825 8.0361 0.4254 65.9368 59.1579 58.9562 11.5087 19.0557 43.5473 40.3740 4.4235 31.1260 13.3899 15.5356 1.6269 36.0659 1.6743 25.3757
temp: 298.150 k
press: 1.00000 atm
elementType: 35 8 8 6 6 6 6 6 6 6 6 6 6 6 1 1 1 1 1 1 1 1 1 1 1 1 1 1 1
symmnumber: 1
zpe: 609553.3 jmol-1
zpe.correction: 0.232167 hartree
zpe.thermalcorrener: 0.248916 hartree
zpe.thermalcorrenthalpy: 0.249860 hartree
zpe.thermalcorrgfe: 0.187605 hartree
zpe.sumelectzpe: -590.973412 hartree
zpe.sumelectthermal: -590.956662 hartree
zpe.sumelectthermalent: -590.955718 hartree
zpe.sumelectthermalfe: -591.017973 hartree
dipole: -2.1044 1.0104 0.1731
dipole: 2.3408
quadrupole: -86.8326 -83.6200 -96.1374
quadrupole: 2.8120 9.6130 5.6446
quadrupole: 2.0307 5.2433 -7.2741 2.8120 9.6130 5.6446
hfenergy: -591.2055782 hartree
pointgroup: C01 [X(C11H15Br1O2)]
dipole: 0.4813052 -0.7798041 0.0915374 debye
polarizability: 178.3983484|-12.3654569|177.3653851|1.3518495|-2.035505|81.4313606 unknown
InChI: InChI=1S/C11H15BrO2/c1-6-7(2)11(14-5)9(12)8(3)10(6)13-4/h1-5H3
charge 0 multiplicity 1
29 atoms
Br -1.788058 2.795249 -0.263753
O  2.796864 0.09217 0.492938
O  -2.754008 -0.146769 -0.506206
C  0.773907 -1.236491 0.114942
C  -0.629454 -1.299614 -0.11411
C  1.397101 0.03394 0.229565
C  0.677728 1.261206 0.141615
C  -1.372179 -0.091013 -0.212114
C  -0.714658 1.157334 -0.084486
C  1.593866 -2.505586 0.250388
C  -1.335093 -2.633569 -0.272165
C  1.386103 2.589317 0.305672
C  3.628456 0.121366 -0.725892
C  -3.632588 -0.157593 0.6827
H  2.597218 -2.275694 0.641231
H  1.108908 -3.221243 0.938759
H  1.706814 -3.025243 -0.72161
H  -1.378877 -3.18735 0.686175
H  -2.363061 -2.484155 -0.636891
H  -0.80305 -3.281908 -0.991991
H  1.375687 3.171384 -0.635186
H  0.882628 3.21164 1.066856
H  2.428779 2.427679 0.618721
H  4.672107 0.160967 -0.377034
H  3.401355 1.014874 -1.339594
H  3.469293 -0.788463 -1.336949
H  -3.48713 0.756002 1.288574
H  -3.440204 -1.053332 1.305189
H  -4.660154 -0.184702 0.289355
