program: Gaussian 09
title: 000297351
version: EM64L-G09RevD.01
frameworkgroup: C1[X(C12H13ClO3)]
method: RPBEPBE
basis: SDD
operation: Freq
keyword: #p
keyword: freq=noraman
keyword: PBEPBE/SDD
title: #p freq=noraman PBEPBE/SDD
converged: YES YES NO NO
title: Mulliken charges:
elementType: Cl O O O C C C C C C C C C C C C H H H H H H H H H H H H H
charge: -0.057791 -0.275223 -0.237428 -0.265841 0.440781 -0.385386 0.318689 -0.367934 -0.381043 -0.228344 -0.222136 -0.107745 -0.797025 -0.266682 -0.662666 0.302475 0.247131 0.256825 0.240578 0.255443 0.256331 0.251530 0.273362 0.244338 0.236107 0.230187 0.220728 0.232745 0.247993
chargesum: 0.00000
title: Mulliken charges with hydrogens summed into heavy atoms:
elementType: Cl O O O C C C C C C C C C C C C
charge: -0.057791 -0.275223 -0.237428 -0.265841 0.440781 -0.138256 0.318689 -0.111109 -0.140465 0.027099 0.034195 -0.107745 -0.027794 0.199613 0.038801 0.302475
polarizability: 2.82727762e+02 -4.27225374e+00 1.32395090e+02 4.32851696e+00 3.92451809e+00 8.05723385e+01
1716.lowfreq: -14.2277 -4.2141 -0.0019 0.0012 0.0013 2.7659 22.3414 31.9064 41.2022
frequency: 22.0147 31.8674 40.6977 61.9719 78.7664 92.7005 104.6886 154.0427 174.8383 209.1030 227.3545 231.2417 262.5282 305.8115 316.3869 355.9721 377.6649 409.6127 418.5147 436.4362 476.5455 513.6756 567.1096 623.9850 646.5994 679.6677 690.5868 715.5711 790.9314 792.2351 821.5963 827.3323 831.1999 838.7376 894.3267 949.4858 953.8950 964.8964 991.0532 997.8908 1037.6876 1046.2924 1075.2117 1094.2363 1109.1342 1130.2286 1160.1307 1170.0485 1190.7088 1233.8613 1279.6090 1299.7260 1338.3706 1357.8575 1376.0956 1391.3484 1395.5657 1402.7738 1457.3299 1460.4219 1463.6012 1467.1047 1480.4497 1485.3516 1572.6859 1598.7280 1631.8102 1684.4018 2989.2836 2994.3500 3032.3746 3074.2094 3089.5635 3097.1037 3101.6736 3120.4048 3123.7653 3135.5039 3156.4676 3170.3935 3177.3778
redmass: 5.1969 4.7509 3.8772 5.5768 4.6119 3.3542 4.4888 3.5319 3.9864 1.6087 4.2034 1.3929 3.3144 2.9500 3.6476 5.0704 4.8713 3.9796 3.9687 3.9074 2.8248 2.6918 4.4292 6.9499 6.3585 5.8702 10.5577 3.7349 3.0718 1.6451 1.7994 1.2592 2.9840 2.5862 1.5035 3.0735 1.3750 1.3754 2.0111 3.8673 2.8110 1.5872 2.7139 2.2475 1.5346 2.4382 1.7800 4.2669 1.1202 2.4727 1.1167 1.3127 2.4864 1.2719 2.5509 1.2336 1.8720 1.8590 1.0912 1.0600 1.0500 1.1000 2.2839 1.0539 7.1827 6.1675 9.3271 7.8950 1.0361 1.0361 1.0606 1.0980 1.0974 1.1023 1.0993 1.0889 1.1064 1.0896 1.0882 1.0957 1.0970
irintensity: 0.1739 0.1273 0.3795 1.6018 0.3283 1.9170 0.4444 3.5374 0.2259 1.5146 0.7913 2.8725 0.1243 20.1168 2.4875 5.7219 3.0479 7.3557 6.5594 1.6618 3.1929 32.3230 14.9336 0.6397 1.4707 8.7319 26.3560 3.0327 21.7704 11.2054 23.0783 1.5457 27.5278 36.9770 53.5297 37.5918 6.4629 0.2719 20.7275 52.3615 111.3134 3.6628 59.9643 141.4274 43.3346 636.1525 42.8314 819.5002 3.7967 18.0834 8.3263 0.6005 2.4872 6.7702 0.8492 23.8863 15.0836 31.9449 30.1045 11.8113 14.2012 8.8432 83.8701 14.5748 2.5283 10.2399 206.7705 69.9414 12.5381 18.0559 30.6715 10.8898 34.9365 2.1222 12.7491 11.2522 31.8384 9.8264 3.6729 7.8955 2.7074
temp: 298.150 k
press: 1.00000 atm
elementType: 17 8 8 8 6 6 6 6 6 6 6 6 6 6 6 6 1 1 1 1 1 1 1 1 1 1 1 1 1
symmnumber: 1
zpe: 583375.6 jmol-1
zpe.correction: 0.222196 hartree
zpe.thermalcorrener: 0.238682 hartree
zpe.thermalcorrenthalpy: 0.239626 hartree
zpe.thermalcorrgfe: 0.175587 hartree
zpe.sumelectzpe: -1149.609076 hartree
zpe.sumelectthermal: -1149.592590 hartree
zpe.sumelectthermalent: -1149.591646 hartree
zpe.sumelectthermalfe: -1149.655685 hartree
dipole: 3.0340 -0.2062 0.3813
dipole: 3.0648
quadrupole: -93.4084 -95.5662 -104.1344
quadrupole: -3.0178 -1.5421 -3.2794
quadrupole: 4.2946 2.1368 -6.4314 -3.0178 -1.5421 -3.2794
hfenergy: -1149.8312721 hartree
pointgroup: C01 [X(C12H13Cl1O3)]
dipole: -1.2003313 0.085749 -0.076146 debye
polarizability: 282.8746308|3.3937973|87.0593574|-1.0433964|17.6301957|125.7612028 unknown
InChI: InChI=1S/C12H13ClO3/c1-3-15-12(14)16-9(2)8-10-4-6-11(13)7-5-10/h4-8H,3H2,1-2H3
charge 0 multiplicity 1
29 atoms
Cl 6.337707 -0.0746 -0.519026
O  -1.983708 0.522507 0.652425
O  -4.133728 0.126569 1.039832
O  -3.038394 -1.223008 -0.543604
C  1.778889 0.176777 0.405692
C  0.35427 0.275573 0.77036
C  -0.727193 0.364788 -0.053819
C  2.252038 -0.400331 -0.809206
C  2.749063 0.642201 1.341316
C  3.631571 -0.476586 -1.094851
C  4.130467 0.576213 1.070001
C  4.553035 0.021914 -0.15418
C  -0.806005 0.491018 -1.551933
C  -5.40771 -0.627743 0.803078
C  -6.150912 -0.077019 -0.415524
C  -3.056224 -0.288882 0.287182
H  0.132444 0.312068 1.84521
H  1.546402 -0.837925 -1.520679
H  2.413432 1.073639 2.291452
H  3.983281 -0.930388 -2.025909
H  4.862073 0.945468 1.7943
H  0.155226 0.84154 -1.960943
H  -1.079327 -0.466557 -2.029358
H  -1.584691 1.227435 -1.821926
H  -5.1649 -1.69799 0.680814
H  -5.966343 -0.467532 1.738267
H  -7.132946 -0.577216 -0.506511
H  -6.325809 1.007616 -0.312227
H  -5.583409 -0.265545 -1.342234
