program: Gaussian 09
title: 000297361
version: EM64L-G09RevD.01
frameworkgroup: C1[X(C16H22O4)]
method: RPBEPBE
basis: SDD
operation: Freq
keyword: #pfreq=noraman
keyword: PBEPBE/SDD
title: #p freq=noraman PBEPBE/SDD
converged: YES YES NO NO
title: Mulliken charges:
elementType: O O O O C C C C C C C C C C C C C C C C H H H H H H H H H H H H H H H H H H H H H H
charge: -0.243265 -0.243278 -0.292239 -0.292249 -0.429059 -0.429038 -0.408463 -0.408462 -0.065604 -0.065603 -0.384857 -0.384855 -0.310530 -0.310537 0.351662 0.351601 -0.311563 -0.398512 -0.398517 -0.311567 0.222178 0.205093 0.222172 0.205094 0.225122 0.218350 0.225121 0.218347 0.242483 0.242498 0.207417 0.202619 0.207416 0.202617 0.217221 0.213307 0.217217 0.213306 0.292576 0.246096 0.246098 0.292588
chargesum: 0.00000
title: Mulliken charges with hydrogens summed into heavy atoms:
elementType: O O O O C C C C C C C C C C C C C C C C
charge: -0.243265 -0.243278 -0.292239 -0.292249 -0.001787 -0.001772 0.035009 0.035006 0.176879 0.176895 0.025178 0.025178 0.119998 0.119986 0.351662 0.351601 -0.018988 -0.152416 -0.152419 -0.018978
polarizability: 2.62833441e+02 1.74104722e+00 1.59701068e+02 -8.38944897e-03 -1.55328900e-02 1.37201377e+02
1716.lowfreq: -5.4120 -4.1719 -0.0009 -0.0005 -0.0003 17.0291 17.9259 36.8726 49.1732
frequency: 17.0501 36.8479 49.0847 55.9946 71.3179 91.6452 102.3212 147.2654 178.1596 181.0970 210.9560 239.8705 270.1832 310.6877 335.9776 358.4813 366.8428 375.6315 417.6847 430.0854 434.1867 448.8202 491.2763 509.6477 523.2160 538.2004 586.9729 624.4463 634.5656 673.4756 709.5213 745.5233 772.6843 773.3064 787.1295 815.7214 819.8291 827.4175 839.8206 848.7435 848.9412 877.7003 877.8813 885.4878 894.8138 933.1353 935.9770 940.2134 953.9976 1001.0568 1007.5059 1009.3198 1018.2786 1018.4118 1051.7189 1052.2944 1105.0394 1106.3700 1113.8685 1117.3178 1118.3688 1169.0376 1169.0979 1173.4232 1177.1590 1184.3555 1192.4746 1219.7535 1252.9899 1253.0632 1270.7552 1271.1010 1303.1225 1310.7163 1314.4311 1332.8631 1335.0156 1343.3745 1344.5032 1348.5503 1349.5287 1355.2320 1355.7700 1366.2077 1366.3801 1374.1322 1420.7072 1445.4226 1445.4632 1455.7016 1455.7348 1460.2155 1460.2331 1472.9927 1473.5038 1489.1255 1584.3739 1621.7839 2984.5460 2984.5970 2989.2475 2989.3608 2998.0083 2998.0263 3001.5971 3001.6489 3025.9281 3026.1471 3044.5744 3044.6628 3059.1114 3059.1697 3073.1758 3073.2144 3088.5961 3088.6479 3153.0135 3154.2070 3174.7399 3177.8178
redmass: 4.4839 3.6128 4.4181 4.2791 3.7421 3.8714 4.5810 4.0602 4.0719 2.9427 4.6960 2.3206 2.7965 3.4671 1.8790 1.9245 3.8142 6.8046 3.1366 4.0487 3.7158 4.0029 2.6723 2.3363 2.5098 3.4163 5.4032 3.8485 5.7969 3.6310 3.8468 3.5646 4.3388 3.7538 2.4801 1.5632 1.4054 1.9684 1.8423 2.9159 2.8380 2.7039 2.7700 3.0269 3.0175 1.5381 1.6372 1.3809 1.3302 2.8308 2.6256 2.6712 2.5402 2.5242 1.8895 1.9003 1.8562 2.0229 1.8401 2.0342 1.4796 1.2924 1.5593 1.2782 1.5360 1.4442 1.9030 4.5439 1.2352 1.2350 1.2095 1.2119 1.2591 1.3768 1.3831 1.2000 1.1969 1.4057 1.3823 1.4850 1.5042 1.4335 1.4080 1.2803 1.2729 5.3921 3.6720 1.0912 1.0910 1.0886 1.0885 1.0855 1.0847 1.1038 1.0895 2.3766 7.4367 6.6466 1.0599 1.0599 1.0655 1.0655 1.0605 1.0605 1.0649 1.0649 1.0859 1.0860 1.1001 1.1001 1.1010 1.1010 1.1024 1.1024 1.1019 1.1019 1.0886 1.0889 1.0957 1.0966
irintensity: 0.5570 0.6161 0.0125 1.6697 1.1371 0.0190 0.0013 7.2266 0.0972 11.5058 3.3089 0.4968 0.3575 15.1325 1.4066 4.6357 1.7559 1.9352 0.0414 21.7042 0.0001 1.0160 3.9746 6.9279 5.1720 23.5815 6.5989 0.9283 0.5677 0.1280 3.7752 40.0467 1.1543 19.0470 6.2639 35.3791 10.4913 9.4650 64.6561 32.3640 0.9791 2.8765 15.4039 681.0667 17.9003 77.9957 16.9889 21.4807 0.1414 42.4733 112.0578 59.2110 64.1952 7.5009 6.2111 17.6800 19.7207 29.8593 44.4091 5.2138 28.3430 0.1589 223.4373 2.6289 171.8528 28.8166 93.6114 1.2808 8.4170 0.9392 17.1370 1.6623 1.4098 36.0543 0.2161 23.5922 1.1402 1.5338 0.2347 8.4193 0.5036 0.0108 0.0731 4.2487 0.0589 36.7860 0.5699 5.7402 10.9317 19.2926 6.6294 7.9738 5.9780 45.8056 4.8047 333.3093 0.0414 0.1031 54.0498 23.2656 15.5885 53.0619 52.9807 7.5391 28.0535 11.5289 12.1504 89.8768 33.9904 29.0538 39.0021 65.4940 71.9144 10.3319 74.8969 7.7990 13.1913 0.0169 2.6294 0.1546
temp: 298.150 k
press: 1.00000 atm
elementType: 8 8 8 8 6 6 6 6 6 6 6 6 6 6 6 6 6 6 6 6 1 1 1 1 1 1 1 1 1 1 1 1 1 1 1 1 1 1 1 1 1 1
symmnumber: 1
zpe: 930860.5 jmol-1
zpe.correction: 0.354546 hartree
zpe.thermalcorrener: 0.372799 hartree
zpe.thermalcorrenthalpy: 0.373744 hartree
zpe.thermalcorrgfe: 0.306510 hartree
zpe.sumelectzpe: -922.239359 hartree
zpe.sumelectthermal: -922.221106 hartree
zpe.sumelectthermalent: -922.220162 hartree
zpe.sumelectthermalfe: -922.287395 hartree
dipole: 0.0007 0.0002 0.3710
dipole: 0.3710
quadrupole: -91.8740 -121.5017 -113.8875
quadrupole: 4.8006 -0.0046 0.0114
quadrupole: 17.2138 -12.4140 -4.7997 4.8006 -0.0046 0.0114
hfenergy: -922.5939051 hartree
pointgroup: C01 [X(C16H22O4)]
dipole: -0.0003104 0.0000455 0.1459448 debye
polarizability: 262.7322622|3.6680644|159.802245|0.0384953|-0.0041068|137.2013785 unknown
InChI: InChI=1S/C16H22O4/c1-3-11-17-15(5-1)19-13-7-9-14(10-8-13)20-16-6-2-4-12-18-16/h7-10,15-16H,1-6,11-12H2
charge 0 multiplicity 1
42 atoms
O  -3.974249 1.264788 0.118817
O  3.973722 -1.263521 0.120338
O  -2.731069 -0.727375 -0.520304
O  2.730653 0.728919 -0.518152
C  -5.029263 -0.557273 -1.204638
C  5.029019 0.559134 -1.202057
C  -5.622328 -1.160451 0.090375
C  5.621741 1.161777 0.093367
C  -3.760922 0.254962 -0.908002
C  3.760598 -0.253217 -0.906092
C  -5.83652 -0.047998 1.144329
C  5.835691 0.048879 1.146899
C  -4.519058 0.708508 1.385567
C  4.518184 -0.707767 1.387464
C  -1.377119 -0.308689 -0.513292
C  1.376658 0.310316 -0.512284
C  -0.961755 1.046535 -0.496932
C  0.416381 1.34687 -0.506426
C  -0.416834 -1.345247 -0.506614
C  0.961286 -1.044912 -0.496115
H  -4.784711 -1.344957 -1.939001
H  -5.763056 0.128967 -1.669492
H  4.784678 1.347124 -1.936163
H  5.762935 -0.126923 -1.66699
H  -4.924788 -1.920648 0.490114
H  -6.576205 -1.672206 -0.133913
H  4.924071 1.92178 0.49325
H  6.575659 1.673658 -0.130459
H  -3.403763 0.832607 -1.781252
H  3.403614 -0.830484 -1.779661
H  -6.607872 0.663459 0.789752
H  -6.191559 -0.475916 2.101864
H  6.607158 -0.662404 0.792222
H  6.190464 0.476397 2.104711
H  -4.655147 1.591809 2.030066
H  -3.759949 0.038968 1.836722
H  4.654133 -1.591336 2.031627
H  3.758943 -0.038432 1.838701
H  -1.699308 1.851714 -0.445671
H  0.76093 2.385717 -0.503212
H  -0.761395 -2.38409 -0.503585
H  1.698854 -1.850046 -0.444277
