program: Gaussian 09
title: 000297391
version: EM64L-G09RevD.01
frameworkgroup: C1[X(C16H20O4)]
method: RPBEPBE
basis: SDD
operation: Freq
keyword: #pfreq=noraman
keyword: PBEPBE/SDD
title: #p freq=noraman PBEPBE/SDD
converged: YES YES NO NO
title: Mulliken charges:
elementType: O O O O C C C C C C C C C C C C C C C C H H H H H H H H H H H H H H H H H H H H
charge: -0.262598 -0.274455 -0.434286 -0.249589 -0.064061 -0.550887 -0.349865 0.422819 -0.050135 -0.371782 0.177110 -0.608364 0.213592 0.133504 -0.850791 -0.891597 0.167801 0.349612 -0.757265 -0.632048 0.252952 0.237690 0.235358 0.202622 0.219850 0.237093 0.224362 0.257851 0.278753 0.226438 0.222641 0.235919 0.271344 0.233003 0.362964 0.240546 0.241960 0.215514 0.230108 0.256317
chargesum: 0.00000
title: Mulliken charges with hydrogens summed into heavy atoms:
elementType: O O O O C C C C C C C C C C C C C C C C
charge: -0.262598 -0.274455 -0.071322 -0.249589 0.188891 -0.077840 0.072607 0.422819 -0.050135 0.089673 0.177110 -0.350513 0.213592 0.133504 -0.122958 -0.151331 0.167801 0.349612 -0.059245 -0.145623
polarizability: 2.41503934e+02 1.11487374e+01 1.96586415e+02 -1.00376811e+01 -8.45126870e+00 1.27522645e+02
1716.lowfreq: -9.4442 -7.2694 -0.0008 -0.0003 0.0003 0.7237 19.6529 21.9441 31.0594
frequency: 19.6147 21.9273 31.0294 62.0476 63.3728 80.0859 100.1593 121.5565 132.7014 154.2122 174.3041 180.2430 193.8168 196.8931 231.0858 247.9392 294.2146 296.5342 306.3160 329.0356 353.0280 367.7913 379.8210 388.3443 411.3666 433.4851 439.7503 492.9428 511.8138 521.8625 534.4850 576.4798 590.1166 611.8316 622.5113 632.2623 709.0206 732.9664 766.3510 781.9749 792.8973 857.2244 878.8820 900.6765 909.3805 925.2613 953.7739 956.0637 990.7973 993.0872 1009.3215 1023.2524 1025.5819 1046.8011 1052.9489 1075.2746 1078.8444 1090.7143 1098.7869 1107.3310 1141.6966 1149.6695 1188.8311 1193.7029 1226.1165 1232.0853 1276.1565 1282.1853 1289.4822 1299.0769 1329.2559 1359.0358 1369.8072 1382.7767 1386.5283 1388.5436 1397.1395 1400.0980 1415.9370 1425.7924 1452.0348 1456.6107 1457.5160 1462.2700 1472.0537 1476.4346 1476.4729 1485.3524 1488.8651 1498.8781 1589.0179 1612.7037 1637.1408 1653.5852 2949.1644 2960.8025 2971.1272 2976.4296 2990.9083 3003.8234 3011.1446 3012.8629 3043.8681 3047.6494 3071.6843 3074.7821 3083.3417 3098.5350 3104.7263 3104.8237 3116.4312 3149.7509 3216.5784 3584.8799
redmass: 4.1483 4.3224 4.3671 4.1325 4.6660 1.1593 2.5993 1.8715 5.4970 1.2538 1.0793 3.3855 4.0090 3.9671 1.3402 2.5868 3.8296 3.0172 3.5909 2.6773 3.9423 3.4049 3.0717 4.4693 3.0705 2.8584 5.0198 5.0391 4.6331 3.3866 4.5026 3.7105 4.1055 3.6705 4.0648 1.6640 5.1593 4.0605 5.3049 2.0399 3.1492 1.4160 2.5930 1.5532 3.7239 2.1125 2.1024 2.1612 1.3163 4.0576 1.3901 1.5689 2.1639 1.5656 1.5062 2.5874 2.2593 3.6477 2.7239 3.9071 1.8632 1.5576 1.3829 2.1082 1.2115 1.9018 1.2443 1.2577 3.1078 1.5734 5.4892 1.3756 1.3438 1.5843 2.9283 1.3030 1.1684 1.2971 1.2518 2.7224 1.5974 1.0465 1.1021 1.1041 1.0600 1.1034 1.0709 1.9120 1.2394 1.0498 7.2121 9.9297 7.0972 5.1370 1.0419 1.0665 1.0658 1.0399 1.0362 1.0750 1.0636 1.0978 1.0965 1.0975 1.0991 1.0970 1.1067 1.1009 1.0619 1.0919 1.0951 1.0920 1.1156 1.0654
irintensity: 0.5223 0.9334 0.5995 2.1965 1.5946 0.1014 0.2356 0.1500 0.3502 0.5192 0.4506 5.7855 0.5260 0.6033 97.7812 21.9084 11.4810 18.1769 2.4305 0.4220 17.6358 2.0331 0.9647 2.4541 4.0982 0.3145 0.3190 5.7800 13.5787 1.2283 8.0736 2.5814 0.5347 3.7553 1.3334 14.7867 19.3360 3.2959 12.6452 8.7785 9.7044 10.7322 19.4318 12.4577 21.1454 0.9541 24.4380 17.9975 56.4171 30.1592 16.4816 8.9786 19.0655 0.0601 7.2580 103.6112 14.9958 194.3356 37.6618 285.4998 20.5150 73.7075 11.9719 53.2256 13.9347 105.9656 20.0229 1.4869 82.2550 3.1591 2.6859 8.8337 1.6466 11.3327 12.0870 10.0939 23.7549 28.0182 13.2315 72.2982 1.0949 11.8584 16.6266 5.1515 39.2826 14.9876 37.1510 53.9259 20.0678 1.0961 18.3083 124.9237 4.9780 3.4599 46.2375 53.7017 20.5076 37.2761 16.1376 18.3868 35.4841 23.3985 23.0567 23.1234 19.2875 16.7151 30.9606 26.6817 5.3658 11.1887 4.5419 3.9844 5.6664 30.9005
temp: 298.150 k
press: 1.00000 atm
elementType: 8 8 8 8 6 6 6 6 6 6 6 6 6 6 6 6 6 6 6 6 1 1 1 1 1 1 1 1 1 1 1 1 1 1 1 1 1 1 1 1
symmnumber: 1
zpe: 854064.1 jmol-1
zpe.correction: 0.325296 hartree
zpe.thermalcorrener: 0.346243 hartree
zpe.thermalcorrenthalpy: 0.347187 hartree
zpe.thermalcorrgfe: 0.273809 hartree
zpe.sumelectzpe: -921.081999 hartree
zpe.sumelectthermal: -921.061052 hartree
zpe.sumelectthermalent: -921.060108 hartree
zpe.sumelectthermalfe: -921.133485 hartree
dipole: -0.3742 -0.9129 1.6606
dipole: 1.9316
quadrupole: -95.6813 -116.0931 -123.3618
quadrupole: -1.2267 6.3972 3.1894
quadrupole: 16.0307 -4.3810 -11.6497 -1.2267 6.3972 3.1894
hfenergy: -921.4072944 hartree
pointgroup: C01 [X(C16H20O4)]
dipole: 0.1474518 0.2219058 0.7117 debye
polarizability: 241.1422032|10.5647203|190.8642413|10.4446016|21.8460918|133.6065497 unknown
InChI: InChI=1S/C16H20O4/c1-9(2)16(18)20-8-12-5-13-6-14(17)10(3)11(4)15(13)19-7-12/h6,12,17H,1,5,7-8H2,2-4H3
charge 0 multiplicity 1
40 atoms
O  1.516796 2.124793 0.479523
O  -3.206376 0.61139 0.570248
O  3.528123 -2.955624 -0.868569
O  -3.636802 0.063829 -1.663495
C  -0.820797 1.270901 0.427514
C  -0.389206 0.013474 -0.359686
C  0.137447 2.423555 0.061413
C  1.117894 -0.205215 -0.281899
C  1.997134 0.834241 0.120083
C  -2.270578 1.686532 0.139498
C  3.40375 0.642563 0.219006
C  1.67562 -1.459366 -0.606563
C  3.947304 -0.630853 -0.106541
C  3.063241 -1.665615 -0.523599
C  4.286853 1.796446 0.665653
C  5.437316 -0.924319 -0.025127
C  -3.83117 -0.140488 -0.439752
C  -4.73696 -1.179016 0.156248
C  -4.843962 -1.283562 1.663251
C  -5.416873 -1.978621 -0.711804
H  -0.712145 1.079414 1.513443
H  -0.706464 0.12091 -1.417277
H  -0.912336 -0.878043 0.031447
H  0.120641 2.604654 -1.034569
H  -0.113038 3.359485 0.589156
H  -2.430205 1.885006 -0.937008
H  -2.561646 2.567007 0.738241
H  1.036161 -2.290918 -0.920476
H  3.684186 2.705903 0.80387
H  4.790842 1.574354 1.625818
H  5.075438 2.015636 -0.078495
H  5.861128 -1.191366 -1.015287
H  6.004205 -0.054806 0.338765
H  5.655317 -1.75939 0.672546
H  4.511498 -3.00738 -0.778656
H  -3.858121 -1.485943 2.118877
H  -5.201253 -0.334931 2.102133
H  -5.538904 -2.090967 1.949525
H  -6.09607 -2.759925 -0.354139
H  -5.297085 -1.855044 -1.793614
