program: Gaussian 09
title: 000297321
version: EM64L-G09RevD.01
frameworkgroup: C1[X(C9H14N4O2)]
method: RPBEPBE
basis: SDD
operation: Freq
keyword: #p
keyword: freq=noraman
keyword: PBEPBE/SDD
title: #p freq=noraman PBEPBE/SDD
converged: YES YES NO NO
title: Mulliken charges:
elementType: O O N N N N C C C C C C C C C H H H H H H H H H H H H H H
charge: -0.281305 -0.325359 -0.077061 -0.416044 -0.123633 -0.016268 -0.003511 0.145907 -0.388679 0.249945 -0.122475 -0.219927 -0.629519 -0.593831 -0.675379 0.278322 0.332450 0.307394 0.223290 0.223399 0.225139 0.226241 0.285980 0.230861 0.245430 0.230515 0.208033 0.230017 0.230069
chargesum: 0.00000
title: Mulliken charges with hydrogens summed into heavy atoms:
elementType: O O N N N N C C C C C C C C C
charge: -0.281305 -0.325359 -0.077061 -0.083595 -0.123633 -0.016268 -0.003511 0.145907 -0.110358 0.249945 0.184919 0.226762 0.107841 0.112975 -0.007259
polarizability: 2.16759646e+02 -2.16902293e+01 1.63167498e+02 3.14801071e-02 3.66199805e-02 7.38624647e+01
1716.lowfreq: -6.1957 0.0007 0.0008 0.0009 1.1163 5.5203 30.5275 49.0548 74.8140
frequency: 30.4472 49.0335 74.8120 75.7872 97.4468 103.2664 112.7165 118.1270 141.4967 201.2538 209.9831 235.6510 255.2261 269.9840 299.2118 344.6690 362.8969 374.1009 391.6281 448.2434 487.5260 565.5450 615.6842 664.1556 677.1818 755.8748 759.6631 792.1523 799.5027 837.2062 863.0575 867.8853 897.0014 1017.7546 1018.6870 1045.8106 1056.4469 1062.6420 1098.9074 1099.0519 1112.3233 1136.0364 1145.9649 1190.4465 1217.2991 1245.6685 1253.6009 1261.9266 1306.4700 1345.6861 1381.2280 1384.3058 1399.0173 1403.9249 1413.5155 1438.7040 1462.8342 1463.4907 1467.0282 1474.2362 1478.3471 1485.7764 1488.6702 1497.9621 1545.6764 1577.2304 1642.3540 2964.2981 2970.3850 2994.5693 3005.0467 3032.7648 3037.4586 3045.8129 3062.4182 3091.1099 3102.4664 3105.9351 3119.1663 3238.8332 3613.0421
redmass: 2.9087 2.5031 3.7167 3.7843 2.4017 1.6224 4.4601 2.3367 1.3111 2.5993 4.1822 1.7857 1.7678 5.0280 4.5123 6.6330 3.8657 3.2244 3.6932 3.7750 6.1051 5.1307 3.4793 1.3733 8.7247 5.3695 7.7472 6.9845 1.1009 3.8088 1.3877 4.1570 4.8728 1.3851 2.4142 4.2010 1.4106 5.8988 1.7664 1.2379 2.2043 1.4565 1.3812 1.6630 4.0295 1.1391 4.3711 2.6525 5.7788 1.7559 3.3976 1.3745 1.3722 2.0469 1.1715 1.2385 1.0405 1.0435 1.2497 1.0935 1.9469 1.0458 1.1251 1.3103 4.3273 6.4152 6.7319 1.0355 1.0356 1.0359 1.0578 1.0968 1.1014 1.1015 1.1066 1.0985 1.0986 1.1023 1.0978 1.0980 1.0818
irintensity: 0.4630 0.1727 3.0991 1.4664 3.2143 0.0939 1.0169 0.9699 0.0411 0.0590 3.6691 0.3594 2.1342 4.7579 5.3046 7.0617 14.3219 17.5639 1.9101 0.4086 3.3431 5.5956 16.2344 80.8925 1.1689 40.3724 4.0821 3.1793 2.3951 0.1364 21.6264 7.4106 61.7068 14.1573 19.2451 340.9563 10.7306 263.3867 117.6242 6.0442 3.7129 5.0415 0.2349 17.4679 225.1388 0.0182 13.6667 28.4782 27.3404 46.9299 91.8890 45.0157 9.1261 60.1305 9.8667 45.6799 11.3042 8.9055 36.8595 10.0085 4.0434 29.2609 14.9036 24.9629 280.8396 256.3571 893.9285 61.5421 144.6924 25.0817 23.8559 51.6583 44.3425 28.1533 12.3847 31.7162 15.0114 45.8463 1.7575 0.9278 70.4190
temp: 298.150 k
press: 1.00000 atm
elementType: 8 8 7 7 7 7 6 6 6 6 6 6 6 6 6 1 1 1 1 1 1 1 1 1 1 1 1 1 1
symmnumber: 1
zpe: 608784.1 jmol-1
zpe.correction: 0.231874 hartree
zpe.thermalcorrener: 0.247995 hartree
zpe.thermalcorrenthalpy: 0.248939 hartree
zpe.thermalcorrgfe: 0.186986 hartree
zpe.sumelectzpe: -719.655899 hartree
zpe.sumelectthermal: -719.639778 hartree
zpe.sumelectthermalent: -719.638833 hartree
zpe.sumelectthermalfe: -719.700787 hartree
dipole: 3.3998 -3.6721 -0.0029
dipole: 5.0043
quadrupole: -62.3617 -90.6255 -90.2129
quadrupole: 2.9842 0.0027 -0.0023
quadrupole: 18.7050 -9.5588 -9.1462 2.9842 0.0027 -0.0023
hfenergy: -719.8877724 hartree
pointgroup: C01 [X(C9H14N4O2)]
dipole: 1.3457163 1.3971241 0.336837 debye
polarizability: 216.6148999|22.6744234|156.3439894|-1.623656|23.155804|80.8307196 unknown
InChI: InChI=1S/C9H14N4O2/c1-4-15-9(14)7-5-11-12-8(7)10-6-13(2)3/h5-6,12H,4H2,1-3H3
charge 0 multiplicity 1
29 atoms
O  -2.754052 0.446926 0.291088
O  -0.703741 1.535383 0.490482
N  3.342406 1.074554 0.122571
N  0.473452 -2.53287 -0.78057
N  1.826875 -0.669137 -0.307063
N  -0.824111 -3.040986 -0.856478
C  -0.816676 -0.809276 -0.195686
C  0.557308 -1.203681 -0.39217
C  -1.593568 -1.981173 -0.49769
C  -1.352504 0.47831 0.216828
C  2.063555 0.585959 0.051894
C  -3.410077 1.719362 0.705822
C  4.512754 0.24223 -0.19206
C  3.58971 2.46726 0.517846
C  -4.912494 1.4528 0.714916
H  -2.67654 -2.074466 -0.462342
H  1.2708 -3.125963 -1.002484
H  1.262285 1.297796 0.309839
H  -3.025987 2.005782 1.702061
H  -3.125824 2.512387 -0.009903
H  5.192208 0.184803 0.679762
H  5.07214 0.666301 -1.047983
H  4.154732 -0.765643 -0.449141
H  4.208138 2.511358 1.435416
H  2.632824 2.976993 0.715129
H  4.121447 3.0141 -0.28492
H  -5.453851 2.367181 1.019702
H  -5.266011 1.156858 -0.287675
H  -5.164597 0.646249 1.424608
