program: Gaussian 09
title: 000003538
version: EM64L-G09RevD.01
frameworkgroup: C1[X(C17H15N3O2)]
method: RPBEPBE
basis: SDD
operation: Freq
keyword: #p
keyword: freq=noraman
keyword: PBEPBE/SDD
title: #p freq=noraman PBEPBE/SDD
converged: YES YES NO NO
title: Mulliken charges:
elementType: O O N N N C C C C C C C C C C C C C C C C C H H H H H H H H H H H H H H H
charge: -0.264292 -0.265035 -0.119873 -0.063216 -0.690390 0.390667 0.281129 -0.729523 -0.568420 0.186743 0.171158 -0.083319 -0.501019 0.182418 0.346892 -0.203284 -0.781619 -0.367836 -0.380033 -0.432934 -0.420171 0.492036 0.268348 0.233060 0.262005 0.294863 0.239197 0.237881 0.228982 0.256707 0.230455 0.249003 0.273060 0.216378 0.216574 0.306010 0.307396
chargesum: 0.00000
title: Mulliken charges with hydrogens summed into heavy atoms:
elementType: O O N N N C C C C C C C C C C C C C C C C C
charge: -0.264292 -0.265035 -0.119873 -0.063216 -0.076983 0.390667 0.281129 -0.228115 -0.306415 0.186743 0.171158 -0.083319 -0.206156 0.182418 0.346892 0.273793 -0.065474 -0.118833 -0.106972 -0.216556 -0.203598 0.492036
polarizability: 3.37656218e+02 -2.56148974e+01 2.53392230e+02 -1.15580650e+01 -9.22158869e+00 1.26993330e+02
1716.lowfreq: -45.8166 -4.6919 -1.3484 -0.0005 -0.0001 0.0006 5.7414 44.3281 54.5868
frequency: -45.7829 44.3165 54.5836 60.9348 74.4563 113.3064 129.9548 158.8802 184.2589 215.2946 220.7450 264.1343 266.8189 302.0371 306.1305 357.6695 372.6836 373.4300 383.8839 389.2957 390.9389 414.3211 426.2448 454.4918 474.7277 499.9568 520.6385 560.7740 580.8000 628.3276 638.6297 668.3628 678.7350 684.6133 710.2984 727.1323 741.5039 757.9240 791.7981 816.7295 817.6870 822.4846 836.9992 841.5554 865.7708 889.7316 912.5714 917.8951 933.6134 953.9347 972.9110 978.1809 997.6723 1015.5283 1020.9754 1032.2721 1051.8587 1064.9038 1119.1903 1120.5566 1132.6059 1155.1341 1165.0752 1189.5791 1231.0054 1257.4566 1259.8087 1287.2536 1307.3625 1311.5464 1329.3559 1359.4604 1375.9313 1383.6364 1390.9733 1411.7240 1433.2114 1448.7423 1455.7784 1459.9107 1460.7897 1470.6703 1487.4287 1517.3062 1568.1913 1569.7109 1607.1740 1617.6620 1629.6412 1643.5253 2969.4725 2984.5850 3013.9485 3042.6521 3082.8513 3092.0525 3112.8495 3117.2028 3120.8545 3148.2949 3164.8290 3167.5698 3180.1773 3563.9654 3704.3730
redmass: 2.2945 5.2280 5.2852 4.0769 4.4717 5.0086 4.4351 3.7487 1.2332 5.2092 5.4408 6.0604 5.5658 4.6579 5.2888 3.5170 1.7599 1.8247 3.7542 2.1363 1.2949 2.9491 4.1862 4.3840 4.5760 3.9794 4.3608 4.7148 4.2768 6.9370 7.1688 5.3966 9.2704 6.5478 6.6845 4.8110 4.4919 5.5351 4.9939 3.9669 1.5934 2.5757 1.8897 8.0788 1.5469 1.5225 4.1575 3.1828 1.8443 1.3576 1.3715 5.4939 3.1078 2.1600 1.9385 1.5225 2.0979 1.4569 1.0377 1.7713 1.2283 2.3682 1.9336 1.1400 1.4176 1.5696 5.4889 2.3468 1.6323 2.1093 4.2940 1.5107 3.1630 3.0952 1.6531 6.3504 5.0198 1.1243 2.7702 1.3227 1.0948 2.6272 1.2646 3.1851 5.6018 6.8152 9.7277 7.9081 3.2343 1.4205 1.0382 1.0646 1.0533 1.0969 1.0981 1.1190 1.0977 1.0882 1.0891 1.0950 1.0946 1.0929 1.0930 1.0449 1.1040
irintensity: 13.6102 2.9770 0.3225 1.1776 0.7225 2.5883 0.6708 4.2371 0.6597 0.5535 2.2628 0.9553 1.1467 1.3188 4.9000 11.7526 156.6466 135.7809 7.2461 4.1335 1.1607 0.3379 6.3144 3.8562 5.9137 11.7028 14.2239 12.8098 13.2450 3.7910 2.8005 8.2509 0.5353 1.6253 2.9321 0.9301 6.6391 1.1439 27.5254 5.4766 6.9589 4.7918 86.0788 18.8669 7.3619 29.4237 6.1608 32.3019 3.6612 0.7003 4.4124 159.7794 2.7781 7.8729 5.3180 3.0836 34.2094 4.3537 0.0121 6.4577 11.8183 32.7143 25.1563 80.1884 25.7750 19.6702 174.5649 27.7621 31.8158 16.4493 278.9837 2.7351 10.7675 16.8103 23.1165 65.4655 10.8035 21.4057 7.2076 7.3195 11.2810 202.5915 26.4880 64.3546 11.5693 9.3593 11.3258 34.6596 106.2784 414.8144 36.3114 22.3607 139.5185 19.5936 20.1351 30.3092 11.5467 15.9699 39.3711 13.8852 4.7868 3.2905 1.0996 127.5664 20.9849
temp: 298.150 k
press: 1.00000 atm
elementType: 8 8 7 7 7 6 6 6 6 6 6 6 6 6 6 6 6 6 6 6 6 6 1 1 1 1 1 1 1 1 1 1 1 1 1 1 1
symmnumber: 1
zpe: 747602.5 jmol-1
zpe.correction: 0.284747 hartree
zpe.thermalcorrener: 0.302527 hartree
zpe.thermalcorrenthalpy: 0.303471 hartree
zpe.thermalcorrgfe: 0.239355 hartree
zpe.sumelectzpe: -969.914255 hartree
zpe.sumelectthermal: -969.896475 hartree
zpe.sumelectthermalent: -969.895531 hartree
zpe.sumelectthermalfe: -969.959646 hartree
dipole: 0.4003 -3.6083 1.8830
dipole: 4.0897
quadrupole: -89.2380 -121.7118 -129.1192
quadrupole: -10.4548 0.2287 2.1668
quadrupole: 24.1183 -8.3554 -15.7629 -10.4548 0.2287 2.1668
hfenergy: -970.1990015 hartree
pointgroup: C01 [X(C17H15N3O2)]
dipole: 0.1430898 1.4261809 -0.7310772 debye
polarizability: 337.2415837|26.2654975|253.981805|11.354753|-8.2761193|126.8183888 unknown
InChI: InChI=1S/C17H15N3O2/c1-10-6-12-7-15-16(22-9-21-15)8-14(12)17(20-19-10)11-2-4-13(18)5-3-11/h2-5,7-8H,6,9,18H2,1H3
charge 0 multiplicity 1
37 atoms
O  -4.093826 2.152998 -0.322514
O  -2.262549 3.098823 0.915665
N  0.706918 -2.272306 0.388585
N  -0.423613 -3.013087 0.713242
N  5.823868 1.537308 -0.316238
C  -1.698798 -0.721435 -0.744546
C  -0.600101 -0.166719 -0.006205
C  -1.554895 -2.128725 -1.30116
C  -2.919039 -0.001448 -0.890658
C  -2.997888 1.260043 -0.302634
C  -1.917593 1.813934 0.419879
C  0.658864 -0.949452 0.144573
C  -0.716088 1.134545 0.582974
C  -1.487658 -3.033438 -0.065955
C  1.977853 -0.274005 0.043593
C  -3.654085 3.344588 0.457835
C  -2.666369 -3.889458 0.318253
C  2.16099 0.923314 -0.704963
C  3.125713 -0.848525 0.661992
C  3.425624 1.523597 -0.830562
C  4.392194 -0.25823 0.545981
C  4.567349 0.944201 -0.203672
H  -0.613141 -2.230693 -1.876422
H  -2.400794 -2.39856 -1.953334
H  -3.758442 -0.420901 -1.451488
H  0.110443 1.561838 1.155136
H  -4.310617 3.456126 1.337824
H  -3.666843 4.227647 -0.203848
H  -3.578479 -3.271149 0.42876
H  -2.466419 -4.405888 1.270119
H  -2.880239 -4.646078 -0.461819
H  1.306134 1.37811 -1.217008
H  2.992044 -1.772609 1.232597
H  3.538643 2.440309 -1.422575
H  5.257181 -0.717447 1.040737
H  5.950246 2.396144 -0.843635
H  6.638714 1.116526 0.120492
