program: Gaussian 09
title: 000298825
version: EM64L-G09RevD.01
frameworkgroup: C1[X(C13H19O2PS)]
method: RPBEPBE
basis: SDD
operation: Freq
keyword: #p
keyword: freq=noraman
keyword: PBEPBE/SDD
title: #p freq=noraman PBEPBE/SDD
converged: YES YES NO NO
title: Mulliken charges:
elementType: S P O O C C C C C C C C C C C C C H H H H H H H H H H H H H H H H H H H
charge: -0.229118 0.642961 -0.440633 -0.439692 0.312313 -0.028370 -0.402165 -0.402311 -0.738057 -0.737939 -0.733755 0.020195 -0.261826 -0.329178 -0.215117 -0.208727 -0.218744 0.225288 0.231668 0.256638 0.253965 0.234319 0.216680 0.215752 0.216863 0.219049 0.213479 0.219908 0.216335 0.215530 0.214773 0.269119 0.282236 0.235843 0.237622 0.235096
chargesum: 0.00000
title: Mulliken charges with hydrogens summed into heavy atoms:
elementType: S P O O C C C C C C C C C C C C C
charge: -0.229118 0.642961 -0.440633 -0.439692 0.312313 0.196917 0.086141 0.085973 -0.088763 -0.085503 -0.087117 0.020195 0.007293 -0.046941 0.020727 0.028895 0.016352
polarizability: 2.42301061e+02 -5.97037627e+00 1.94915311e+02 -3.36293981e-01 -1.74514308e-01 1.16601744e+02
1716.lowfreq: -8.3515 -0.0006 0.0011 0.0014 6.2650 10.9418 20.6987 28.8364 38.3871
frequency: 20.5358 28.8330 38.3783 68.2348 98.3806 139.0165 141.4626 170.8369 204.6294 210.8669 242.8589 246.5129 258.4178 264.9654 282.6375 298.5999 325.2076 349.2072 359.4485 375.0451 394.9699 405.4585 425.4840 449.6007 487.1998 488.1858 527.3116 566.2416 609.3987 640.1091 683.9089 694.9529 713.3715 767.0636 769.1112 857.8059 866.0157 889.8573 911.4069 912.9748 923.6670 927.6738 935.5614 937.9716 952.5538 985.2410 986.9903 1005.8322 1011.1921 1018.4230 1021.5385 1080.6032 1097.1986 1108.4975 1120.9653 1176.3332 1185.7853 1191.0276 1205.4786 1226.5458 1241.0829 1263.8514 1296.8878 1314.5708 1319.0069 1351.1556 1364.5354 1376.6806 1378.8545 1384.7673 1405.2470 1428.8907 1452.4760 1461.7890 1465.8621 1466.3364 1467.4150 1471.0975 1486.3835 1489.9436 1499.6959 1589.2010 1596.9337 2970.7277 2973.3199 2975.6945 2982.1555 2985.4765 2997.7768 3064.2132 3067.1052 3067.6485 3072.4359 3075.8301 3078.1648 3106.3806 3109.6395 3131.3759 3138.0998 3150.8550 3164.0132 3174.5242
redmass: 3.4406 3.0008 5.1081 4.8614 7.1671 3.2721 4.3857 2.4886 4.4296 1.6200 1.8114 1.9407 1.1634 2.4322 6.0744 2.1769 2.4383 5.2046 3.5799 2.2242 3.0978 5.2386 2.6596 4.5106 3.6020 2.4190 3.7812 7.6105 6.5108 9.1812 13.5626 1.9464 7.3647 1.6423 3.3175 1.2494 3.1561 1.8981 3.0534 2.1146 1.6907 2.6088 1.2299 1.3896 2.4044 1.3867 6.1809 1.3273 1.4478 1.5762 2.8568 1.6229 2.7875 2.8955 2.2156 1.0557 1.8022 1.1271 1.2285 2.3987 2.7631 1.2052 1.5091 1.3029 1.2365 1.2782 1.2782 1.2020 1.1962 8.8777 1.2034 2.1335 1.0728 1.0545 1.0951 1.0588 1.9715 1.0513 1.0504 1.0588 1.0576 6.1077 5.8788 1.0353 1.0364 1.0594 1.0521 1.0666 1.0716 1.0999 1.0995 1.1004 1.0988 1.0981 1.0988 1.0975 1.0989 1.0861 1.0896 1.0924 1.0969 1.1002
irintensity: 0.0007 0.1553 1.1865 0.9441 1.2251 1.4263 6.1107 0.2111 1.8089 0.1848 0.8665 0.8628 0.3368 4.6341 2.2787 2.4689 0.1262 10.6150 1.2448 3.5569 0.7387 4.9568 0.5061 13.2935 7.8224 5.5338 7.3432 75.7249 2.2907 90.7035 154.7083 62.7100 32.8057 37.8779 11.1827 0.4336 33.2883 5.0607 3.7126 36.7626 1.1239 133.8026 1.6719 1.6686 143.3247 0.5331 0.7244 0.0113 0.5153 14.8740 2.6602 5.6524 45.3598 1.4920 4.0405 0.0680 4.8795 8.0648 0.6316 7.7945 37.0341 0.3381 8.3305 5.2758 1.9163 0.5807 7.9815 22.0324 24.5578 1.6630 16.9159 23.6803 5.6991 0.3218 12.0092 0.8402 4.6156 0.1222 13.9242 9.0037 36.1997 0.5850 0.5131 27.8712 32.7011 1.1109 17.8259 13.6541 54.1430 1.4403 6.8657 6.0443 65.3305 103.7086 48.2662 20.1513 7.9253 0.9388 1.4817 10.6685 23.2845 18.5462
temp: 298.150 k
press: 1.00000 atm
elementType: 16 15 8 8 6 6 6 6 6 6 6 6 6 6 6 6 6 1 1 1 1 1 1 1 1 1 1 1 1 1 1 1 1 1 1 1
symmnumber: 1
zpe: 772438.8 jmol-1
zpe.correction: 0.294206 hartree
zpe.thermalcorrener: 0.312391 hartree
zpe.thermalcorrenthalpy: 0.313335 hartree
zpe.thermalcorrgfe: 0.247058 hartree
zpe.sumelectzpe: -1395.212077 hartree
zpe.sumelectthermal: -1395.193893 hartree
zpe.sumelectthermalent: -1395.192949 hartree
zpe.sumelectthermalfe: -1395.259226 hartree
dipole: -1.1818 -3.4158 -0.0112
dipole: 3.6145
quadrupole: -90.5913 -120.3783 -124.5398
quadrupole: -3.5191 -0.1016 -0.1665
quadrupole: 21.2452 -8.5419 -12.7033 -3.5191 -0.1016 -0.1665
hfenergy: -1395.5062839 hartree
pointgroup: C01 [X(C13H19O2P1S1)]
dipole: 0.3970195 -1.3547064 0.1714037 debye
polarizability: 242.6994295|3.1290798|193.1727375|-3.6340442|-9.8327501|117.9459492 unknown
InChI: InChI=1S/C13H19O2PS/c1-13(2,3)11-9-14-16(17,15-10-11)12-7-5-4-6-8-12/h4-8,11H,9-10H2,1-3H3
charge 0 multiplicity 1
36 atoms
S  -0.447806 2.974229 -0.312652
P  -0.665047 0.939245 -0.029906
O  0.094503 -0.076493 -1.248722
O  0.157182 0.282542 1.379986
C  3.776104 -0.480887 0.060458
C  2.197597 -0.436498 0.089526
C  1.584544 0.057061 -1.247355
C  1.64423 0.401613 1.272165
C  4.248715 -1.383736 -1.11568
C  4.403309 0.93176 -0.106988
C  4.299063 -1.112943 1.382486
C  -2.34888 0.220833 0.105994
C  -2.498707 -1.175762 0.276836
C  -3.470448 1.076701 0.03707
C  -3.798139 -1.717732 0.379507
C  -4.765935 0.524217 0.141055
C  -4.929739 -0.870291 0.311981
H  1.843628 -1.478058 0.239547
H  1.840023 1.116441 -1.450504
H  1.893766 -0.566718 -2.098246
H  1.997933 0.028836 2.244325
H  1.901059 1.47492 1.170409
H  4.042553 -0.931159 -2.102462
H  5.341075 -1.54381 -1.051844
H  3.758711 -2.375533 -1.082757
H  4.072544 1.423075 -1.040012
H  5.505392 0.849045 -0.147407
H  4.152342 1.599914 0.736843
H  3.828255 -2.096863 1.570006
H  5.392288 -1.267393 1.320138
H  4.110202 -0.469302 2.26039
H  -1.616965 -1.821392 0.326548
H  -3.322109 2.154724 -0.095899
H  -3.927671 -2.797184 0.511323
H  -5.641955 1.179098 0.088876
H  -5.936116 -1.2962 0.391967
