program: Gaussian 09
title: 000298789
version: EM64L-G09RevD.01
frameworkgroup: C1[X(C8H10O3)]
method: RPBEPBE
basis: SDD
operation: Freq
keyword: #pfreq=noraman
keyword: PBEPBE/SDD
title: #p freq=noraman PBEPBE/SDD
converged: NO NO NO NO
title: Mulliken charges:
elementType: O O O C C C C C C C C H H H H H H H H H H
charge: -0.265669 -0.234353 -0.250253 -0.529940 0.274243 -0.469928 0.015445 -0.513692 -0.305054 -0.301427 0.142193 0.271315 0.271456 0.243082 0.243101 0.246522 0.246536 0.232148 0.232163 0.226064 0.226048
chargesum: 0.00000
title: Mulliken charges with hydrogens summed into heavy atoms:
elementType: O O O C C C C C C C C
charge: -0.265669 -0.234353 -0.250253 0.012831 0.274243 0.016255 0.015445 -0.020634 0.159257 0.150684 0.142193
polarizability: 1.34045768e+02 1.80566806e+00 9.35682346e+01 -2.93791624e-04 -4.72528253e-03 5.86300992e+01
1716.lowfreq: -137.6336 -41.5492 0.0008 0.0008 0.0009 8.2808 8.8664 24.3556 76.4022
frequency: -137.6276 -38.0391 76.2705 125.6430 131.4481 146.5712 246.6617 315.9884 376.1918 522.5232 538.8261 657.1903 691.6042 694.9562 699.5953 770.2473 773.1598 822.0796 861.0166 882.2721 921.6998 931.0148 963.0968 991.7684 1027.2132 1051.2762 1065.9006 1083.7599 1157.9576 1169.4159 1190.1898 1193.5930 1201.7126 1229.1731 1230.2289 1261.5060 1284.5075 1306.2379 1341.7142 1353.8498 1452.8551 1472.9066 1480.9473 1491.0558 1496.9650 1654.9715 1695.7078 2999.5218 3023.3072 3029.4908 3030.6697 3040.7802 3044.6823 3070.6221 3084.0951 3094.0141 3105.5569
redmass: 1.6518 1.9294 3.3344 3.9983 5.0060 5.7846 3.6857 7.1848 5.6324 3.5348 7.2645 9.2779 6.4761 7.1424 6.3934 1.1451 7.0937 1.2224 7.3293 1.3507 4.3099 3.5083 6.7390 4.5142 3.7889 1.6043 1.6225 3.3863 1.1446 1.1270 5.0447 1.1629 1.1099 3.5053 1.0897 1.4669 1.5263 1.5836 1.3410 1.5166 1.0785 1.0815 1.0834 1.0866 1.0919 11.4531 11.7347 1.0596 1.0577 1.0589 1.0599 1.0639 1.1043 1.1045 1.1060 1.1101 1.1072
irintensity: 1.8230 3.9006 0.4301 3.0756 9.3464 8.3756 0.6429 1.1758 0.0102 0.0768 3.0251 3.1574 12.9145 4.9620 0.7142 10.0409 12.1040 0.2250 5.3993 1.3406 82.7126 28.7016 326.2487 59.9621 32.9974 0.0005 0.0015 7.6177 0.3402 0.4039 76.9810 0.0026 0.1888 230.3747 1.4138 19.3173 8.0275 0.4537 3.2853 3.3194 4.0716 6.7303 7.2708 1.9240 2.4020 376.6250 225.2804 15.7275 24.2536 100.3998 25.1476 25.8353 6.5479 0.1371 0.5811 35.5117 44.2828
temp: 298.150 k
press: 1.00000 atm
elementType: 8 8 8 6 6 6 6 6 6 6 6 1 1 1 1 1 1 1 1 1 1
symmnumber: 1
zpe: 439963.8 jmol-1
zpe.correction: 0.167573 hartree
zpe.thermalcorrener: 0.176173 hartree
zpe.thermalcorrenthalpy: 0.177117 hartree
zpe.thermalcorrgfe: 0.133082 hartree
zpe.sumelectzpe: -535.674274 hartree
zpe.sumelectthermal: -535.665675 hartree
zpe.sumelectthermalent: -535.664731 hartree
zpe.sumelectthermalfe: -535.708765 hartree
dipole: 4.4380 -3.6730 0.0007
dipole: 5.7608
quadrupole: -55.9708 -71.1744 -62.1164
quadrupole: 12.1106 0.0134 -0.0083
quadrupole: 7.1164 -8.0872 0.9708 12.1106 0.0134 -0.0083
hfenergy: -535.8418476 hartree
pointgroup: C01 [X(C8H10O3)]
dipole: -1.800709 1.3675552 -0.1554242 debye
dipolederiv: -1.4283656 0.1462776 -0.0361669 0.8097596 -0.5903011 0.0450161 -0.0941473 0.0316467 -0.2649295 -1.2464925 -0.4897985 0.0229984 -0.295901 -0.743232 0.0322135 0.0056074 0.027908 -0.3060751 -0.6106559 -0.1007659 0.0029296 0.1365096 -1.2204741 0.0803532 -0.0178453 0.0755184 -0.3377458 0.0036868 -0.1011712 0.0065664 -0.1842827 -0.1881689 0.0223802 0.0132634 0.024254 0.1107302 1.5539823 -0.2301951 0.049875 -0.6171919 0.5266318 -0.0501114 0.0836181 -0.0424061 0.0950369 -0.0684585 0.1083368 -0.0132881 0.0381507 -0.0833436 0.0202994 -0.0073623 0.0216225 0.1418485 -1.2409411 0.3053621 -0.0482671 0.4830268 -0.23638 0.0146052 -0.0632818 0.0111011 -0.1860605 -0.0399085 0.034462 -0.0081461 -0.1147068 -0.0301377 0.0173569 0.0047455 0.0204432 0.1954707 0.9071849 -0.0972005 0.019614 0.1348419 0.2496056 0.0105328 -0.0004789 0.0057813 0.338243 0.3329875 0.0237601 -0.0026235 0.3414419 0.5753011 -0.0122383 -0.0303659 -0.0188433 0.3553386 1.8642027 0.3665179 0.002237 -0.4259597 1.5280687 -0.1213476 0.0718872 -0.1048697 0.247837 0.0193697 0.02561 0.0340088 0.0072299 0.0468873 -0.0567459 0.022564 -0.0704786 0.0149754 0.0223918 0.0170891 -0.0370609 0.001474 0.0675705 0.0474495 -0.0225779 0.0618363 -0.0074869 0.0067523 -0.0509727 -0.0652667 -0.0698905 0.0383089 -0.0588646 -0.1142179 -0.0800844 -0.0378813 -0.0000953 -0.041283 0.0749002 -0.0507814 0.0592539 0.0402148 0.1265007 0.061975 -0.0519674 0.0476276 0.0259261 -0.0362826 -0.018069 0.0035356 0.0763633 -0.0049129 0.1182074 -0.0553371 0.0457002 0.0372552 0.0344851 -0.0133718 -0.0310928 -0.0809552 0.0112047 -0.1209445 -0.0188111 -0.074969 0.0372627 -0.0602998 -0.0047123 0.0422708 0.0510514 -0.1282961 0.0881085 -0.0724223 -0.0820258 0.0506106 0.0515609 0.0196035 0.0153961 -0.0656238 0.1261923 -0.101197 -0.0386211 -0.0103789 -0.0287473 0.0781379 -0.0773178 -0.0039584 0.0361675 0.1477623 0.0773474 -0.0676274 -0.0015948 -0.0383359 -0.0699114 -0.0998528 -0.0257417 -0.0481168 -0.1298593 -0.0869266 -0.0545147 unknown
polarizability: 133.8125694|3.4962791|93.5191408|1.2254228|-2.9611971|58.9123919 unknown
InChI: InChI=1S/C8H10O3/c9-8-6(3-5-11-8)7-2-1-4-10-7/h1-5H2
charge 0 multiplicity 1
21 atoms
O  -1.631389 1.19929 -0.051124
O  2.835455 -0.333591 0.175454
O  1.293758 -2.080628 0.294934
C  -1.565118 -1.20318 0.158433
C  -0.78708 0.096273 0.061388
C  -3.065723 -0.784176 0.094449
C  0.568833 0.277733 0.073283
C  1.314481 1.592013 -0.025078
C  -3.062911 0.763159 -0.039967
C  2.810176 1.150882 0.044708
C  1.510098 -0.852566 0.192344
H  -1.274895 -1.886864 -0.657105
H  -1.308111 -1.736994 1.088912
H  -3.570109 -1.253546 -0.766187
H  -3.60227 -1.099878 1.00428
H  1.085249 2.123759 -0.966478
H  1.047673 2.276875 0.800351
H  -3.507795 1.122914 -0.982764
H  -3.541232 1.27874 0.809489
H  3.374486 1.400952 -0.869008
H  3.337221 1.558135 0.923486
