program: Gaussian 09
title: 000298839
version: EM64L-G09RevD.01
frameworkgroup: C1[X(C10H22NO3P)]
method: RPBEPBE
basis: SDD
operation: Freq
keyword: #p
keyword: freq=noraman
keyword: PBEPBE/SDD
title: #p freq=noraman PBEPBE/SDD
converged: YES YES NO NO
title: Mulliken charges:
elementType: P O O O N C C C C C C C C C C H H H H H H H H H H H H H H H H H H H H H H
charge: 1.346202 -0.472597 -0.471764 -0.593097 -0.541186 -0.339468 -0.355944 -0.328211 -0.317904 -0.308101 -0.273878 -0.335097 -0.338402 -0.691430 -0.693574 0.214339 0.227034 0.206667 0.257056 0.227690 0.191010 0.216709 0.185044 0.238635 0.238411 0.234392 0.215466 0.193340 0.189687 0.190231 0.203055 0.216464 0.212156 0.214738 0.216636 0.208590 0.217099
chargesum: 0.00000
title: Mulliken charges with hydrogens summed into heavy atoms:
elementType: P O O O N C C C C C C C C C C
charge: 1.346202 -0.472597 -0.471764 -0.593097 -0.541186 0.101905 0.107779 0.090488 0.083849 0.168944 0.175980 0.047931 0.054885 -0.048072 -0.051249
polarizability: 1.69995541e+02 4.35622869e+00 1.50808718e+02 -6.91180712e+00 9.94263556e-01 1.20221199e+02
1716.lowfreq: -7.7213 0.0003 0.0008 0.0016 6.2231 11.2801 22.9232 30.2982 41.0962
frequency: 22.6915 29.9994 41.0870 48.7916 57.7555 69.5312 86.0091 106.9769 123.9830 134.3680 154.0204 191.9310 206.6586 221.9275 230.3833 241.9458 245.7720 276.0675 308.4794 311.0338 376.2315 398.6154 427.0402 497.2117 532.4701 549.5311 594.3465 625.1295 731.2497 734.3615 747.6235 785.6032 791.4542 841.3949 872.9511 898.6488 899.7506 918.4621 922.9031 981.0825 985.3059 990.5103 1009.6624 1034.6597 1060.5633 1068.5178 1073.1056 1093.4774 1101.9545 1110.8575 1112.4402 1173.1438 1185.4656 1189.2959 1189.6134 1233.7634 1254.4294 1263.9093 1267.2000 1285.2471 1288.7554 1295.7627 1320.2969 1326.2192 1338.3851 1340.5165 1347.9221 1360.7728 1371.0592 1391.0243 1393.0689 1456.2194 1465.6158 1466.4899 1468.5890 1470.0124 1472.9291 1476.6485 1476.9027 1478.7065 1480.3773 1487.1272 1489.6493 2960.1469 2964.6919 2973.4767 2974.2115 2975.0198 2976.7921 2984.3786 2985.3350 3001.6369 3003.8009 3008.8201 3010.5799 3028.9942 3036.1190 3054.5742 3062.8920 3071.6518 3072.1251 3073.7327 3074.8071 3089.7078 3108.5156
redmass: 3.3248 4.1885 2.9090 2.0871 4.0513 1.4986 3.2596 2.3910 2.5992 4.0614 3.3124 2.5588 3.4540 1.8326 1.3416 1.2168 4.4348 7.0700 2.7348 5.3764 4.6450 2.8671 3.4070 5.6020 6.1439 4.9436 8.0879 3.9233 1.0852 1.1045 3.9628 1.1771 1.2839 2.0060 3.6992 1.7335 1.7416 1.3875 1.2243 3.4809 3.5108 3.5111 3.9493 3.2828 7.7168 2.4294 2.5326 1.5832 1.8024 2.3097 2.3817 1.1229 2.6331 1.9608 1.2502 1.5027 1.4121 1.2597 1.2760 1.0770 1.0852 1.1973 1.2354 1.1997 1.3656 1.2902 1.4744 1.4466 1.3287 1.2147 1.2156 1.0725 1.0810 1.0777 1.0748 1.0710 1.0778 1.0666 1.0430 1.0421 1.0646 1.0774 1.0870 1.0592 1.0588 1.0509 1.0420 1.0445 1.0564 1.0618 1.0635 1.0642 1.0986 1.0977 1.0620 1.1002 1.1000 1.1044 1.1032 1.1005 1.1006 1.0997 1.1002 1.1018 1.1062
irintensity: 0.5740 0.9706 1.2122 1.0413 0.8064 0.0771 5.4591 0.3347 2.6308 2.3966 0.6002 1.2998 6.0083 0.5757 0.8158 0.1455 7.2567 3.1027 9.3031 9.0570 15.5459 1.2825 9.8528 23.9088 5.6883 38.5089 34.8877 88.8520 13.0239 37.9446 109.1410 0.6798 0.0277 6.5699 105.9537 12.2242 14.4525 39.5346 3.7799 36.0597 135.0946 2.9772 5.7771 49.9859 110.7399 2.0135 4.8170 10.7205 32.5164 3.5778 17.4616 2.0168 53.9851 20.4231 13.4728 23.4304 9.4579 0.9238 1.1878 0.0853 0.1677 7.8003 4.3058 1.3079 0.3418 3.4268 1.2671 15.4821 13.2279 9.5776 8.2362 8.3060 3.4249 2.4524 1.7533 0.4370 4.3454 6.0091 12.7162 12.4400 1.7912 11.9513 30.0243 24.4598 20.4370 22.7829 8.8628 41.8472 6.9431 97.7465 38.5932 49.8770 15.1664 5.1860 47.9222 1.2070 16.2471 26.5236 5.8828 105.6129 42.9633 54.6887 77.5787 26.5131 22.8584
temp: 298.150 k
press: 1.00000 atm
elementType: 15 8 8 8 7 6 6 6 6 6 6 6 6 6 6 1 1 1 1 1 1 1 1 1 1 1 1 1 1 1 1 1 1 1 1 1 1
symmnumber: 1
zpe: 830648.9 jmol-1
zpe.correction: 0.316377 hartree
zpe.thermalcorrener: 0.335512 hartree
zpe.thermalcorrenthalpy: 0.336456 hartree
zpe.thermalcorrgfe: 0.266366 hartree
zpe.sumelectzpe: -1014.642989 hartree
zpe.sumelectthermal: -1014.623854 hartree
zpe.sumelectthermalent: -1014.622910 hartree
zpe.sumelectthermalfe: -1014.693001 hartree
dipole: -2.1982 3.0506 2.6383
dipole: 4.5933
quadrupole: -87.4943 -103.6417 -106.9355
quadrupole: 9.9135 -5.6857 -5.9363
quadrupole: 11.8629 -4.2846 -7.5783 9.9135 -5.6857 -5.9363
hfenergy: -1014.9593665 hartree
pointgroup: C01 [X(C10H22N1O3P1)]
dipole: -0.7375708 1.3905754 -0.887754 debye
polarizability: 156.9898546|10.1408923|164.8122674|0.3981725|-0.7976591|119.2233352 unknown
InChI: InChI=1S/C10H22NO3P/c1-3-5-7-11(8-6-4-2)15(12)13-9-10-14-15/h3-10H2,1-2H3
charge 0 multiplicity 1
37 atoms
P  1.478074 -0.300687 0.683568
O  2.2272 0.164543 -0.862851
O  1.867971 1.276209 1.424197
O  2.036143 -1.576195 1.445795
N  -0.196658 -0.351451 0.361341
C  -0.888526 0.793951 -0.273106
C  -0.989404 -1.536852 0.775837
C  -1.545367 1.760177 0.739676
C  -1.263315 -2.520354 -0.382904
C  3.265494 1.185385 -0.585087
C  2.680226 2.116619 0.511016
C  -2.275255 2.929608 0.03986
C  -2.155017 -3.703624 0.06017
C  -2.932931 3.902405 1.042242
C  -2.405747 -4.715932 -1.0780
H  -1.654648 0.385901 -0.962004
H  -0.163936 1.341252 -0.905848
H  -1.944166 -1.174464 1.207009
H  -0.440902 -2.059026 1.580999
H  -0.761907 2.150393 1.417927
H  -2.266105 1.202796 1.371289
H  -0.295395 -2.903545 -0.760604
H  -1.748774 -1.987311 -1.225553
H  3.451039 1.712428 -1.53355
H  4.187691 0.682261 -0.23936
H  3.468604 2.594524 1.114751
H  2.017388 2.885589 0.071692
H  -3.048746 2.52768 -0.646737
H  -1.554484 3.485112 -0.595218
H  -3.125829 -3.316926 0.433234
H  -1.674631 -4.220919 0.915298
H  -3.444955 4.733515 0.523481
H  -3.682329 3.38054 1.666596
H  -2.178456 4.340061 1.722383
H  -3.040214 -5.555313 -0.739066
H  -2.911908 -4.233779 -1.935565
H  -1.452524 -5.139072 -1.446011
