program: Gaussian 09
title: 000298778
version: EM64L-G09RevD.01
frameworkgroup: C1[X(C9H10O4)]
method: RPBEPBE
basis: SDD
operation: Freq
keyword: #pfreq=noraman
keyword: PBEPBE/SDD
title: #p freq=noraman PBEPBE/SDD
converged: NO YES NO NO
title: Mulliken charges:
elementType: O O O O C C C C C C C C C H H H H H H H H H H
charge: -0.289018 -0.462819 -0.402662 -0.238938 0.270823 0.268562 -0.456709 -0.341563 -0.357522 -0.248332 -0.221062 -0.376256 0.231702 0.204794 0.210946 0.241143 0.225063 0.229847 0.228477 0.276944 0.241734 0.373620 0.391228
chargesum: 0.00000
title: Mulliken charges with hydrogens summed into heavy atoms:
elementType: O O O O C C C C C C C C C
charge: -0.289018 -0.089199 -0.011434 -0.238938 0.270823 0.268562 -0.040970 -0.100420 -0.132459 -0.018485 0.007414 0.142422 0.231702
polarizability: 1.30287880e+02 -3.62449704e+00 1.18423737e+02 1.38715765e+01 1.33192161e+00 7.26576163e+01
1716.lowfreq: -13.4943 -7.3788 -0.0010 -0.0008 -0.0006 5.1701 31.2892 56.7908 61.5959
frequency: 31.1514 56.6511 61.5349 103.1031 144.6467 181.1719 207.1181 270.5009 298.8791 347.9119 411.1555 456.4955 461.7553 484.1006 511.1514 566.3224 592.6470 600.1271 610.5534 638.3498 718.9583 746.0813 762.1203 819.6391 829.6502 857.9694 936.8507 944.8970 966.9950 978.7767 1006.5958 1016.4069 1042.0564 1055.0086 1104.5008 1168.1473 1172.2290 1185.6015 1208.4517 1236.6117 1268.0145 1284.2531 1340.2356 1358.6760 1382.6326 1392.7261 1433.2217 1440.2788 1465.7569 1477.4309 1590.9997 1605.8724 1673.6843 3000.3198 3006.7910 3075.7605 3078.1700 3127.2558 3133.9762 3147.7023 3166.6227 3455.0427 3516.0077
redmass: 4.9883 6.3066 7.0068 5.0505 5.7722 4.9756 3.5944 4.7666 3.4518 3.9882 4.2641 3.1664 3.0497 2.6315 4.4672 4.1537 2.5115 1.4872 4.0879 1.3879 4.0101 3.6871 1.4410 3.8596 4.4421 1.5537 1.5538 2.3276 2.5099 1.3339 3.0186 3.6486 2.0937 2.5708 2.2459 1.6930 1.2412 1.1586 2.3119 1.2098 1.6557 1.4667 1.2307 1.6300 6.1339 1.1886 1.6427 1.3157 1.3595 1.7797 6.6866 6.8146 8.8686 1.0625 1.0609 1.1016 1.0995 1.0851 1.0893 1.0943 1.1008 1.0669 1.0643
irintensity: 0.1582 2.4039 0.8631 4.4712 1.0179 0.2225 1.0743 3.2466 5.1742 0.4334 11.3913 21.7491 5.3466 15.6555 44.6427 6.9299 13.6651 93.7521 13.4159 199.3816 13.9797 3.7428 85.2498 10.0617 13.6403 3.8169 14.9301 44.4556 7.4137 0.1651 78.2519 119.8470 29.8760 187.9840 33.9839 57.5093 6.3289 48.6077 18.6468 24.9334 9.6136 2.8927 9.3954 21.7195 3.8641 42.1786 13.5952 50.3683 16.0514 39.8479 13.3667 9.0926 235.3396 58.3049 27.0723 28.8129 6.9101 3.3912 6.0356 28.2299 21.6157 209.4047 29.7048
temp: 298.150 k
press: 1.00000 atm
elementType: 8 8 8 8 6 6 6 6 6 6 6 6 6 1 1 1 1 1 1 1 1 1 1
symmnumber: 1
zpe: 461844.1 jmol-1
zpe.correction: 0.175907 hartree
zpe.thermalcorrener: 0.188078 hartree
zpe.thermalcorrenthalpy: 0.189022 hartree
zpe.thermalcorrgfe: 0.136334 hartree
zpe.sumelectzpe: -648.864033 hartree
zpe.sumelectthermal: -648.851862 hartree
zpe.sumelectthermalent: -648.850918 hartree
zpe.sumelectthermalfe: -648.903607 hartree
dipole: 2.1105 -4.1214 -0.0643
dipole: 4.6308
quadrupole: -59.2218 -81.4005 -76.2477
quadrupole: -0.9464 -0.7620 3.8034
quadrupole: 13.0682 -9.1105 -3.9577 -0.9464 -0.7620 3.8034
hfenergy: -649.0399404 hartree
pointgroup: C01 [X(C9H10O4)]
dipole: 0.6663127 1.6597111 0.3474083 debye
dipolederiv: -1.3798092 -0.1642745 0.0842717 -0.3077902 -0.350322 0.0580688 0.3316745 0.0903213 -0.3956332 -0.6441861 0.3124979 -0.04568 0.2113709 -0.6275747 -0.0703014 -0.1092309 0.0288662 -0.6306078 -1.1150097 -0.3653105 -0.2690342 -0.343595 -0.4781861 -0.2407623 -0.4648836 -0.2962835 -0.541874 -0.6749711 -0.1557906 -0.1693334 -0.3943443 -0.9189602 0.0056588 -0.1278014 0.203777 -0.4367397 -0.2577821 -0.0637872 0.0078455 -0.1343885 -0.0159565 0.083812 0.0190102 -0.103319 -0.129431 1.1076944 0.1291712 -0.2443496 0.0798138 0.1203908 -0.067115 -0.5193227 -0.081178 0.1262167 0.4333309 -0.1633349 0.0921454 -0.1266758 0.4604758 0.0073392 0.0848968 0.0863066 0.530854 0.038333 0.0816982 -0.0637499 0.0735421 0.0682352 0.0014928 -0.0861129 0.0009217 -0.0992387 -0.2318089 -0.0008782 -0.0224128 0.1695036 -0.0268184 -0.0349894 0.0830418 0.0193182 -0.1821625 0.0180436 0.0059498 -0.090361 0.0375908 -0.1394817 0.0010769 -0.0742706 0.0138912 -0.1229094 0.0134323 0.037746 -0.075502 -0.026807 0.084673 0.068234 -0.0785889 0.0435252 -0.1017245 0.7531595 0.0830141 0.0984672 0.3710934 0.1630577 0.1304702 0.155463 0.1402813 0.1786452 1.1548633 0.4279497 0.4897108 0.5343534 1.1053284 -0.0046196 0.5557056 -0.1358014 0.6811361 -0.0737341 -0.103804 -0.1027916 -0.0657854 -0.038357 -0.0677327 -0.035925 -0.0089604 0.0529695 -0.0155454 0.046223 0.1201211 0.0220128 0.0296285 0.0889234 0.0559689 0.0295382 -0.1216364 0.053986 -0.0693082 0.0202236 -0.1039111 -0.0479217 -0.0076702 0.0270422 -0.0220506 0.1291544 0.0430767 -0.1152434 0.0369054 -0.1092246 -0.0412345 -0.0045555 0.0420784 0.0029684 0.1392821 -0.0849059 -0.0017807 0.1047535 -0.0077453 0.0885929 -0.0158624 0.1109025 -0.0213687 0.1129293 0.0511989 0.0571112 0.0550074 0.0752297 -0.0594674 -0.0775387 0.0579313 -0.0800851 0.117991 -0.0645114 -0.0267704 0.0379392 -0.0142481 0.1216119 -0.0048453 0.0482691 0.0261462 0.0445446 0.0527028 0.0650086 -0.025336 -0.0184498 -0.0432504 -0.0636984 -0.0733644 -0.0947926 0.0498681 0.4528045 -0.0282517 -0.0004742 0.0410389 0.3444759 0.0773284 0.046792 0.0422735 0.3101575 0.3696379 0.0121645 -0.0383661 0.0374157 0.2010606 0.1372864 -0.0492761 0.1157043 0.2882087 unknown
polarizability: 131.3159463|6.1073922|117.8806385|-8.4437148|7.9717815|72.1726482 unknown
InChI: InChI=1S/C9H10O4/c10-5-7-3-1-2-4-8(7)13-6-9(11)12/h1-4,10-11H,5-6H2
charge 0 multiplicity 1
23 atoms
O  0.704365 0.39288 -1.111989
O  0.076955 -2.838769 0.096824
O  3.46348 0.903717 1.257886
O  2.083285 -0.940757 0.985753
C  -1.277254 -0.823901 -0.429871
C  -0.56611 0.405044 -0.453345
C  -0.65187 -2.108645 -0.952875
C  -2.570301 -0.820378 0.148548
C  -1.116944 1.594841 0.072603
C  -3.13502 0.354627 0.692211
C  -2.4047 1.564508 0.652719
C  1.807474 1.067694 -0.463176
C  2.420943 0.210991 0.647296
H  -1.441957 -2.806027 -1.277801
H  0.011793 -1.889827 -1.811031
H  -3.126589 -1.764415 0.184758
H  -0.568405 2.5415 0.012916
H  -4.134696 0.329523 1.138455
H  -2.837392 2.484901 1.059922
H  2.574409 1.234489 -1.239212
H  1.539781 2.053213 -0.037481
H  0.805683 -2.251813 0.440752
H  3.881369 0.344104 1.967639
