program: Gaussian 09
title: 000298803
version: EM64L-G09RevD.01
frameworkgroup: C1[X(C19H17O2P)]
method: RPBEPBE
basis: SDD
operation: Freq
keyword: #p
keyword: freq=noraman
keyword: PBEPBE/SDD
title: #p freq=noraman PBEPBE/SDD
converged: YES YES NO NO
title: Mulliken charges:
elementType: P O O C C C C C C C C C C C C C C C C C C C H H H H H H H H H H H H H H H H H
charge: 1.091396 -0.500077 -0.648609 -0.104691 -0.096539 -0.491433 -0.270090 -0.239409 -0.291783 -0.314766 0.461653 -0.216048 -0.220046 -0.207253 -0.208198 -0.224607 -0.224142 -0.357913 -0.385236 -0.227340 -0.226326 -0.232248 0.249148 0.223331 0.270478 0.245395 0.270426 0.286547 0.233245 0.232815 0.233544 0.234127 0.279365 0.232787 0.231772 0.232396 0.227104 0.224543 0.226682
chargesum: 0.00000
title: Mulliken charges with hydrogens summed into heavy atoms:
elementType: P O O C C C C C C C C C C C C C C C C C C C
charge: 1.091396 -0.500077 -0.648609 -0.104691 -0.096539 -0.018954 0.000388 0.005985 -0.021357 -0.028218 0.461653 0.017197 0.012770 0.026291 0.025929 0.007165 0.008253 -0.078548 -0.152449 -0.000236 -0.001783 -0.005566
polarizability: 2.70274226e+02 -3.58029860e+01 1.85374910e+02 9.75324159e+00 1.25873361e+00 2.07537902e+02
1716.lowfreq: -13.0570 0.0015 0.0015 0.0020 1.0961 7.0145 15.7900 19.3288 26.5024
frequency: 15.4617 18.3469 26.2605 34.0829 44.4273 45.6673 76.4324 91.3096 155.0928 158.8556 170.3392 206.2519 230.1612 250.1405 273.6786 326.1534 341.3256 362.8223 394.6996 397.3716 406.0149 436.7085 447.7899 486.3215 507.1400 518.4678 580.7075 608.9556 610.7755 617.1186 627.5210 683.8515 698.5296 702.7952 703.7841 707.5412 759.1544 761.8582 766.6389 812.2921 857.2906 860.1991 864.2122 891.6193 932.7858 937.0561 938.9827 965.6143 979.6853 984.2659 984.8290 986.0143 986.6274 989.3120 993.3878 1003.9578 1004.3288 1005.6860 1021.5158 1022.0999 1027.3716 1076.7796 1081.9362 1089.8245 1093.3309 1096.0313 1172.4999 1173.9424 1174.1913 1187.6029 1189.5122 1190.7169 1221.5375 1228.4035 1309.5885 1313.7050 1331.6436 1344.7961 1379.0285 1381.3477 1385.5048 1425.6757 1428.5480 1442.3721 1464.3573 1465.1095 1466.8063 1485.2905 1587.3781 1590.1608 1594.0973 1596.3632 1597.3776 1614.4717 3013.3159 3090.6224 3116.3362 3121.9843 3127.7411 3127.9341 3132.4425 3135.3525 3136.1117 3143.9900 3145.4013 3145.9101 3154.4830 3155.6582 3161.7639 3167.2770 3167.7264
redmass: 5.2115 4.1885 4.3880 3.9125 5.4214 4.2499 5.5818 4.9489 5.6982 6.3271 6.4623 4.8220 5.3781 7.2119 6.7273 3.9067 2.9156 6.8143 2.7941 2.8248 2.8344 4.4787 4.8723 4.5656 4.2275 5.4426 4.9715 6.3654 6.4554 6.3054 7.1212 6.8844 2.8306 2.2471 2.0446 2.1238 2.0223 1.7346 1.7196 3.4879 1.2539 1.2566 1.2483 6.8485 1.3820 1.4507 1.4440 1.8157 3.6208 1.4876 1.6577 1.6660 4.1098 4.5601 4.9096 1.3790 1.3318 1.3256 2.8348 2.8913 2.2192 1.6145 1.6602 1.6166 2.6152 2.7837 1.0544 1.0561 1.0548 1.1256 1.1233 1.1264 2.8216 1.1302 1.3214 1.3085 1.2580 1.1903 8.6015 8.9910 8.0652 2.1142 2.1334 2.1794 1.2011 1.8674 2.0420 2.2277 6.1020 6.1656 6.0700 5.8591 5.8438 6.0076 1.0603 1.1056 1.0863 1.0878 1.0850 1.0850 1.0920 1.0879 1.0881 1.0926 1.0961 1.0927 1.0968 1.0967 1.1015 1.1017 1.1017
irintensity: 0.7472 0.1763 0.1308 0.0495 0.4940 0.3734 0.2929 0.2387 3.1285 3.6266 11.1408 2.7672 6.1211 10.0695 3.2487 4.9463 6.2125 4.7317 0.3327 0.0483 0.1347 11.7457 16.2403 18.4179 52.7174 113.8980 41.9948 10.3176 0.3063 2.7804 58.9526 27.8666 5.5444 60.3314 119.2093 45.4758 114.7819 26.9132 17.5603 12.8971 0.1469 1.3035 1.6946 283.7236 1.1517 3.0896 2.8857 6.8829 34.1337 1.7807 2.9005 0.4452 1.9943 0.4357 17.1657 1.3668 0.1460 0.1802 3.5687 1.8102 3.0864 2.1664 7.0331 11.3285 40.2339 39.2467 0.0146 0.1404 0.0905 4.1439 3.7734 0.6140 26.5116 1.7534 0.8079 6.3429 0.4534 14.5034 0.2019 0.9047 0.4589 3.1934 32.9605 9.3669 20.7383 2.7795 7.1900 7.0150 0.1375 0.3168 0.8207 0.0679 0.3970 0.1862 35.9033 7.6454 4.5536 0.5141 0.0323 0.3110 9.1021 2.5399 6.0784 6.1466 28.6909 8.4957 18.1815 21.5866 29.6634 41.0446 18.8852
temp: 298.150 k
press: 1.00000 atm
elementType: 15 8 8 6 6 6 6 6 6 6 6 6 6 6 6 6 6 6 6 6 6 6 1 1 1 1 1 1 1 1 1 1 1 1 1 1 1 1 1
symmnumber: 1
zpe: 799845.2 jmol-1
zpe.correction: 0.304645 hartree
zpe.thermalcorrener: 0.324376 hartree
zpe.thermalcorrenthalpy: 0.325320 hartree
zpe.thermalcorrgfe: 0.252227 hartree
zpe.sumelectzpe: -1224.341871 hartree
zpe.sumelectthermal: -1224.322140 hartree
zpe.sumelectthermalent: -1224.321195 hartree
zpe.sumelectthermalfe: -1224.394288 hartree
dipole: 0.4115 2.2793 -2.4970
dipole: 3.4058
quadrupole: -116.6735 -129.1557 -130.3402
quadrupole: -5.4405 1.3582 3.2385
quadrupole: 8.7163 -3.7659 -4.9504 -5.4405 1.3582 3.2385
hfenergy: -1224.646516 hartree
pointgroup: C01 [X(C19H17O2P1)]
dipole: 0.4240818 -0.3807044 1.2127131 debye
polarizability: 212.563887|48.9915732|247.3162771|-19.163267|-3.455506|203.3068733 unknown
InChI: InChI=1S/C19H17O2P/c20-22(18-12-6-2-7-13-18,19-14-8-3-9-15-19)21-16-17-10-4-1-5-11-17/h1-15H,16H2
charge 0 multiplicity 1
39 atoms
P  0.501103 0.788153 -0.600078
O  -0.910345 1.414766 0.247561
O  0.352104 0.701387 -2.200012
C  0.802853 -0.85229 0.226269
C  1.803605 2.004841 -0.073343
C  -2.203214 1.415654 -0.518184
C  0.294492 -1.123328 1.517507
C  2.064216 2.27974 1.288981
C  1.552625 -1.824623 -0.476743
C  2.527423 2.658955 -1.096635
C  -2.911988 0.078861 -0.461848
C  0.552967 -2.377521 2.114812
C  3.060672 3.221845 1.627722
C  1.805738 -3.076572 0.126843
C  3.524286 3.598688 -0.750287
C  1.311154 -3.351089 1.423519
C  3.791087 3.879991 0.609754
C  -2.660919 -0.902954 -1.455659
C  -3.823549 -0.213099 0.584316
C  -3.310318 -2.156074 -1.399722
C  -4.473954 -1.466075 0.641114
C  -4.218366 -2.44037 -0.352396
H  -1.987033 1.710087 -1.56189
H  -2.779261 2.209353 -0.014721
H  -0.321965 -0.376007 2.028237
H  1.497268 1.774771 2.078675
H  1.91399 -1.60772 -1.488257
H  2.297564 2.428231 -2.143228
H  0.156196 -2.597269 3.111928
H  3.26652 3.442008 2.680858
H  2.382421 -3.835157 -0.413538
H  4.088888 4.109264 -1.537992
H  -1.944072 -0.680233 -2.255883
H  -4.024159 0.543879 1.353053
H  1.507964 -4.323443 1.889048
H  4.564525 4.609051 0.876416
H  -3.109597 -2.908697 -2.170458
H  -5.180228 -1.681208 1.451121
H  -4.724193 -3.411893 -0.311661
