program: Gaussian 09
title: 000298759
version: EM64L-G09RevD.01
frameworkgroup: C1[X(C8H7N3O6)]
method: RPBEPBE
basis: SDD
operation: Freq
keyword: #pfreq=noraman
keyword: PBEPBE/SDD
title: #p freq=noraman PBEPBE/SDD
converged: YES YES NO YES
title: Mulliken charges:
elementType: O O O O O O N N N C C C C C C C C H H H H H H H
charge: -0.283329 -0.182275 -0.240514 -0.189373 -0.178389 -0.251923 -0.457635 0.037787 0.021664 0.409873 0.173776 -0.467953 0.448146 -0.321416 -0.389739 0.271140 -0.490700 0.364066 0.298669 0.299189 0.389024 0.248239 0.248244 0.243429
chargesum: 0.00000
title: Mulliken charges with hydrogens summed into heavy atoms:
elementType: O O O O O O N N N C C C C C C C C
charge: -0.283329 -0.182275 -0.240514 -0.189373 -0.178389 -0.251923 -0.068611 0.037787 0.021664 0.409873 0.173776 -0.103888 0.448146 -0.022747 -0.090550 0.271140 0.249212
polarizability: 2.04318556e+02 -8.32835220e+00 1.86292152e+02 -4.70416370e-03 1.54978491e-03 5.46493990e+01
1716.lowfreq: -4.2916 -4.0588 -0.0011 -0.0007 -0.0001 4.6388 41.2325 46.7653 59.5348
frequency: 41.2299 46.7503 59.5340 72.5007 79.5172 88.8791 105.3996 161.7444 170.5044 226.5431 232.3628 278.6893 293.8370 300.3714 339.0766 345.5949 437.6632 493.0110 502.3187 548.7723 556.3340 604.4626 652.3526 675.0478 687.8433 697.6712 707.1840 731.7921 757.5293 786.0204 854.9875 894.8799 899.3772 928.8562 965.8217 999.6483 1022.8094 1054.8519 1090.8366 1120.7442 1131.6652 1150.5217 1159.2802 1197.7497 1216.7738 1231.5270 1282.0325 1334.3621 1382.5398 1386.0747 1428.1441 1443.1331 1453.7571 1464.5710 1474.7074 1524.8710 1585.7313 1625.6624 1657.0282 3009.8593 3113.9971 3157.6696 3178.8902 3184.1951 3204.0867 3294.9430
redmass: 10.2980 6.4317 3.9686 1.3931 7.4879 6.0157 5.0489 4.2511 9.7509 6.8018 6.0907 7.7342 6.1530 13.5578 9.5979 7.0199 3.7951 10.4414 8.7059 5.8919 6.1920 6.6793 6.6996 9.4919 5.9010 8.2081 5.6481 5.8564 11.7787 9.1987 1.4492 1.1363 7.6070 5.9533 1.3689 1.3210 5.8252 4.9894 2.0206 1.2551 2.5075 1.5457 1.7196 7.3287 10.0592 2.0049 1.7356 7.2200 5.0550 13.3876 1.1927 3.1345 1.0486 1.0663 4.2851 2.7659 5.0647 7.4664 7.2580 1.0297 1.1052 1.1049 1.0927 1.0893 1.0970 1.0788
irintensity: 0.0506 0.9987 0.3556 0.9134 7.9124 0.4881 0.0060 7.7209 4.4213 1.6713 9.6833 20.4804 0.8113 0.4817 4.9208 3.8235 1.8461 0.4633 7.7350 5.4249 0.0079 0.0788 10.0064 3.0576 2.3626 0.0263 28.3526 1.0961 60.2052 9.3240 32.0987 118.1050 3.4027 11.4074 34.8521 0.4218 47.1667 69.8824 49.8048 0.2134 160.2789 176.8808 85.7349 579.6525 11.5345 110.6160 22.7607 376.3452 129.3445 77.3573 34.8309 4.9758 16.1051 17.2785 111.6858 439.0292 194.5688 138.8592 153.1777 35.3433 22.5747 12.1502 35.7324 4.2643 4.2711 128.8562
temp: 298.150 k
press: 1.00000 atm
elementType: 8 8 8 8 8 8 7 7 7 6 6 6 6 6 6 6 6 1 1 1 1 1 1 1
symmnumber: 1
zpe: 417419.7 jmol-1
zpe.correction: 0.158987 hartree
zpe.thermalcorrener: 0.174407 hartree
zpe.thermalcorrenthalpy: 0.175351 hartree
zpe.thermalcorrgfe: 0.114292 hartree
zpe.sumelectzpe: -923.257939 hartree
zpe.sumelectthermal: -923.242519 hartree
zpe.sumelectthermalent: -923.241575 hartree
zpe.sumelectthermalfe: -923.302634 hartree
dipole: 2.8145 0.3696 -0.0001
dipole: 2.8386
quadrupole: -91.8478 -117.9974 -94.7654
quadrupole: -22.7430 0.0028 -0.0012
quadrupole: 9.6891 -16.4605 6.7715 -22.7430 0.0028 -0.0012
hfenergy: -923.4169255 hartree
pointgroup: C01 [X(C8H7N3O6)]
dipole: 1.1141352 0.0771131 -0.0000207 debye
dipolederiv: -1.8181366 0.6430051 -0.0001565 0.2187397 -0.5704559 0.0000747 -0.0005241 0.0002367 -0.3141438 -0.4529978 0.1334661 0.0000003 0.1117922 -1.0773007 -0.000001 0.0000537 -0.0001421 -0.2101983 -0.8031854 -0.193471 0.0000758 0.0091752 -0.4610126 -0.000013 -0.0000027 -0.0000077 -0.2494504 -0.831434 0.0309333 0.0000398 -0.1129808 -0.5042945 0.0000014 0.0000754 -0.0000218 -0.2151859 -0.5403925 -0.0443378 0.0000346 -0.018657 -0.7494932 -0.0000417 0.0000252 0.0000027 -0.2028091 -0.7051966 -0.0683889 -0.0001026 0.1045809 -0.9793451 -0.0001823 -0.0000194 0.0001978 -0.3249621 -1.5583017 0.9210141 -0.0000007 0.9993488 -1.2649054 0.0000528 0.0001417 -0.0001012 -0.2973597 1.1373507 0.5316367 -0.0000616 0.1189965 1.8584202 0.0000276 -0.0000875 0.0001033 0.2069609 1.4031439 0.1947772 -0.0000954 0.3596295 1.3054909 0.000026 -0.000094 0.0000295 0.1835325 1.4623067 -0.9005325 -0.0000857 0.0198893 0.157199 -0.0000076 -0.0000717 0.0000421 0.1461734 -0.2861091 -0.5959981 -0.0000155 -0.0166194 -0.7426601 -0.0000208 0.0000775 0.0000041 0.0054486 -0.5401331 0.4814939 0.0000278 -0.2860423 0.0292873 0.0000295 -0.0000021 -0.0000348 -0.121081 0.0321126 -0.5165866 0.0000011 -0.3211175 0.1830126 0.0000261 -0.0000238 0.0000516 0.0946188 0.0317928 0.4724958 0.0000052 -0.1365454 0.132287 0.0000142 -0.0000117 0.0000015 -0.071217 -0.1211307 -0.1829327 -0.0000131 0.1694577 -0.5004507 -0.0000145 0.0000014 0.0000071 -0.135855 2.2902598 -0.6648123 0.0002348 -0.8661409 1.9319255 0.0001471 0.0003096 -0.0002055 0.3333017 0.6390792 -0.2752841 0.00007 -0.4225175 0.4821362 -0.0000982 0.0001609 -0.000103 0.2769665 0.2393328 -0.0143473 0.0000047 -0.0329236 0.1621186 0.0000001 0.0000041 -0.0000027 0.1891303 0.1290705 -0.0233449 0.0000026 0.0317375 0.0672365 -0.0000049 0.0000031 -0.000009 0.166755 0.0723767 0.0240508 0.0000093 0.0026207 0.1310931 -0.0000029 0.0000111 -0.0000166 0.1784642 0.2396112 0.0570663 0.0000085 -0.0797527 0.3728422 -0.0000115 -0.0000029 -0.0000049 0.3277161 0.0455298 -0.0032654 -0.0653676 0.1058823 -0.014704 -0.0721372 -0.0150371 -0.0876825 -0.0481335 0.0454518 -0.0033207 0.0654572 0.1058164 -0.0146534 0.0721579 0.0151045 0.0876529 -0.0480929 -0.110401 -0.0033168 -0.0000729 -0.0643698 0.0662264 -0.0000217 -0.0000913 0.0000024 0.1294206 unknown
polarizability: 203.2293851|-9.3706455|187.3813237|-0.0046001|0.0018358|54.649399 unknown
InChI: InChI=1S/C8H7N3O6/c1-17-8(12)9-6-4-5(10(13)14)2-3-7(6)11(15)16/h2-4,9H,1H3
charge 0 multiplicity 1
24 atoms
O  3.620897 -1.1132 -0.000054
O  0.233968 3.956214 0.00003
O  2.021955 2.555473 -0.000183
O  -4.313222 -1.203774 0.000169
O  -2.638233 -2.75171 -0.000051
O  1.670566 -2.420067 -0.00018
N  1.64684 -0.036984 -0.000364
N  0.731454 2.770308 -0.000195
N  -3.067982 -1.539125 -0.000018
C  0.282808 0.252372 -0.000225
C  -0.185959 1.615422 -0.000129
C  -0.703803 -0.778952 -0.000188
C  -2.059119 -0.433396 -0.000054
C  -1.570206 1.921089 -0.000002
C  -2.527138 0.902009 0.000044
C  2.240948 -1.303857 -0.000473
C  4.42767 -2.356066 0.000389
H  -0.396213 -1.827296 -0.000264
H  -1.861457 2.974083 0.00006
H  -3.598975 1.107895 0.000142
H  2.27096 0.790405 -0.000331
H  4.206688 -2.953072 -0.899762
H  4.205993 -2.952897 0.900484
H  5.46926 -2.007972 0.000757
