program: Gaussian 09
title: 000298761
version: EM64L-G09RevD.01
frameworkgroup: C1[X(C15H14ClNO3)]
method: RPBEPBE
basis: SDD
operation: Freq
keyword: #p
keyword: freq=noraman
keyword: PBEPBE/SDD
title: #p freq=noraman PBEPBE/SDD
converged: YES YES NO NO
title: Mulliken charges:
elementType: Cl O O O N C C C C C C C C C C C C C C C H H H H H H H H H H H H H H
charge: -0.063968 -0.299322 -0.264912 -0.287619 -0.459322 0.469344 -0.487298 -0.363425 -0.364064 0.325600 -0.353571 -0.353830 0.489639 -0.431919 -0.338423 0.288074 -0.183964 -0.195053 -0.119993 -0.538106 0.243708 0.224747 0.234535 0.266353 0.251522 0.242393 0.331989 0.230149 0.304553 0.255120 0.254091 0.223844 0.222717 0.246411
chargesum: 0.00000
title: Mulliken charges with hydrogens summed into heavy atoms:
elementType: Cl O O O N C C C C C C C C C C C C C C C
charge: -0.063968 -0.299322 -0.264912 -0.287619 -0.127333 0.469344 -0.018843 -0.128890 -0.097711 0.325600 -0.102049 -0.111437 0.489639 -0.201770 -0.033870 0.288074 0.071156 0.059038 -0.119993 0.154866
polarizability: 2.76425097e+02 1.27051814e+01 1.69062730e+02 6.16074111e+00 2.16804183e+01 1.46294194e+02
1716.lowfreq: -10.4300 -3.2531 -0.5358 0.0006 0.0011 0.0019 14.6789 28.6743 33.4961
frequency: 14.5589 28.6270 33.4118 49.0507 80.3525 83.4440 93.5036 127.3337 151.4159 190.0526 207.5975 229.0133 234.3093 267.4322 285.7785 329.5950 347.6336 365.5880 381.9934 412.7504 415.3979 429.3201 473.5904 505.4441 506.8905 559.7171 618.6518 632.3178 636.3566 654.1427 677.8213 697.0683 703.1006 706.6324 746.8095 804.1055 813.9647 821.4406 823.1046 840.9843 846.1219 877.6895 937.5354 952.8086 961.2213 966.2162 974.0117 982.6459 988.9193 994.9386 1003.2295 1074.4141 1112.5464 1115.6376 1116.6854 1155.9458 1158.8464 1180.0485 1185.1311 1222.8560 1235.3196 1239.3580 1260.5877 1297.0012 1307.1756 1344.5017 1371.8585 1386.9217 1403.2528 1421.0781 1437.0447 1460.0924 1467.8071 1472.4477 1479.0367 1503.5994 1509.1552 1583.6228 1595.0030 1610.0869 1622.6235 1654.4032 2962.1224 3038.3420 3050.7744 3112.2094 3127.0273 3127.1272 3127.4108 3143.0921 3165.1680 3166.1192 3169.6291 3172.7368 3191.9505 3542.5675
redmass: 7.9658 3.7056 4.2016 7.1734 8.4010 4.3194 6.4680 5.1121 5.8622 5.6255 3.3146 1.6944 4.3793 5.1193 4.0769 5.7549 3.3496 3.4518 5.8147 3.0152 2.9467 5.9512 4.5922 2.8091 3.5352 3.3758 6.8381 6.2617 1.3319 5.6084 6.6526 5.1412 3.7669 4.1262 4.3931 3.7888 1.3821 1.5956 2.8148 1.4190 2.0684 6.1903 1.3538 1.4724 2.6290 1.3877 1.3191 4.3606 4.1881 3.9966 2.6808 2.6160 1.2599 1.3277 1.3046 1.3441 2.9819 1.3032 1.1143 2.2332 3.0958 1.3276 2.0985 1.3413 1.3041 1.2754 4.9289 4.9918 4.0596 3.3758 1.1716 1.1193 1.0498 1.0707 2.2643 2.5418 2.4292 7.0714 5.7262 6.2460 6.3575 7.8696 1.0329 1.0588 1.1040 1.1075 1.0902 1.0903 1.0990 1.0889 1.0907 1.0947 1.0957 1.0954 1.0956 1.0761
irintensity: 0.0220 1.8378 1.4359 0.3150 5.1024 1.5621 2.1092 3.7427 2.4543 2.0515 3.9700 1.4060 2.7901 5.4776 6.4519 0.1402 9.4292 0.2379 24.9851 0.0207 0.0948 6.4041 6.2582 48.6792 11.3568 31.0824 5.1389 2.7473 37.6333 34.5474 11.7144 40.4564 5.1901 3.5327 6.9417 61.1234 41.1186 5.0366 19.6563 64.4097 56.8654 25.5248 1.2921 33.0739 165.6251 10.5829 2.2105 176.7337 112.4829 9.4617 3.8296 59.9346 0.1934 36.8643 5.4040 12.7185 486.1644 48.9639 12.3667 4.0063 181.4310 34.3398 6.3057 17.8200 1.7606 26.0676 120.4920 6.6909 34.2589 2.0803 8.8564 28.2039 13.6008 51.9024 32.7339 125.4966 717.5571 12.3347 30.7119 55.9039 86.5857 209.2733 60.9986 37.5253 47.2149 5.4463 11.1081 19.8930 21.8576 3.0612 2.5279 11.6409 5.3366 2.9114 5.6230 32.8075
temp: 298.150 k
press: 1.00000 atm
elementType: 17 8 8 8 7 6 6 6 6 6 6 6 6 6 6 6 6 6 6 6 1 1 1 1 1 1 1 1 1 1 1 1 1 1
symmnumber: 1
zpe: 679155.9 jmol-1
zpe.correction: 0.258677 hartree
zpe.thermalcorrener: 0.277154 hartree
zpe.thermalcorrenthalpy: 0.278098 hartree
zpe.thermalcorrgfe: 0.208785 hartree
zpe.sumelectzpe: -1319.047163 hartree
zpe.sumelectthermal: -1319.028685 hartree
zpe.sumelectthermalent: -1319.027741 hartree
zpe.sumelectthermalfe: -1319.097054 hartree
dipole: -2.7968 -0.2442 -1.0846
dipole: 3.0097
quadrupole: -133.0819 -110.7403 -119.1861
quadrupole: -12.6219 -8.0598 8.4726
quadrupole: -12.0791 10.2625 1.8167 -12.6219 -8.0598 8.4726
hfenergy: -1319.3058396 hartree
pointgroup: C01 [X(C15H14Cl1N1O3)]
dipole: 1.0804899 -0.1638851 -0.4558346 debye
polarizability: 271.6232269|14.5979116|136.340977|-21.3075592|-11.0139563|183.817817 unknown
InChI: InChI=1S/C15H14ClNO3/c1-19-14-8-2-11(3-9-14)10-20-15(18)17-13-6-4-12(16)5-7-13/h2-9,17H,10H2,1H3
charge 0 multiplicity 1
34 atoms
Cl -6.604093 -1.740076 1.904477
O  0.252208 1.268388 -1.597989
O  5.772926 -1.402488 0.443174
O  -0.486346 1.543743 0.627936
N  -1.66752 0.261424 -0.980228
C  2.616573 1.145482 -0.788683
C  1.503747 2.045857 -1.265841
C  3.545029 0.586476 -1.708194
C  2.757246 0.83717 0.586667
C  4.705973 -0.556917 0.110289
C  4.580791 -0.256491 -1.270676
C  3.790363 -0.009083 1.044506
C  -2.806489 -0.181834 -0.257898
C  -3.73887 -1.005247 -0.945145
C  -3.04155 0.161407 1.100566
C  -0.63129 1.063104 -0.525459
C  -4.893477 -1.482279 -0.292953
C  -4.198261 -0.316254 1.752814
C  -5.109244 -1.129175 1.053025
C  5.951688 -1.747526 1.856431
H  1.230489 2.800113 -0.508384
H  1.743202 2.530669 -2.225055
H  3.453202 0.814923 -2.777009
H  2.038049 1.253555 1.300825
H  5.303573 -0.689303 -1.968714
H  3.872227 -0.229299 2.11285
H  -1.581995 -0.033618 -1.955347
H  -3.565621 -1.277256 -1.993478
H  -2.325718 0.792309 1.630815
H  -5.608749 -2.11621 -0.824283
H  -4.383277 -0.053439 2.798377
H  5.069336 -2.285372 2.254138
H  6.144831 -0.845782 2.469344
H  6.830645 -2.407971 1.880907
