program: Gaussian 09
title: 000298756
version: EM64L-G09RevD.01
frameworkgroup: C1[X(C13H10N2O4)]
method: RPBEPBE
basis: SDD
operation: Freq
keyword: #p
keyword: freq=noraman
keyword: PBEPBE/SDD
title: #p freq=noraman PBEPBE/SDD
converged: NO YES NO NO
title: Mulliken charges:
elementType: O O O O N N C C C C C C C C C C C C C H H H H H H H H H H
charge: -0.342737 -0.229974 -0.196057 -0.252297 -0.453595 0.029455 0.366128 0.186394 -0.305429 -0.331485 -0.223492 -0.223975 0.426553 0.214017 -0.352642 -0.352346 -0.196681 -0.196796 -0.237127 0.312841 0.288446 0.388265 0.241315 0.244011 0.249929 0.249887 0.232226 0.232218 0.232949
chargesum: 0.00000
title: Mulliken charges with hydrogens summed into heavy atoms:
elementType: O O O O N N C C C C C C C C C C C C C
charge: -0.342737 -0.229974 -0.196057 -0.252297 -0.065330 0.029455 0.366128 0.186394 0.007412 -0.043039 0.017822 0.020035 0.426553 0.214017 -0.102713 -0.102459 0.035545 0.035422 -0.004178
polarizability: 2.76925646e+02 4.57677944e+00 1.58940866e+02 1.43757997e-02 -6.13985393e-02 1.07021861e+02
1716.lowfreq: -35.7438 -12.1835 -8.2139 -1.3010 -0.0012 -0.0008 -0.0007 22.2210 47.5467
frequency: -35.7279 21.2493 47.5449 50.8552 64.3092 109.4622 126.8833 153.7648 209.0288 269.3682 271.9869 283.5998 330.2921 386.9873 400.0159 409.2907 424.3965 482.1091 510.6299 525.9883 532.8025 610.0306 622.2391 660.7936 663.6311 682.1092 687.3098 693.0610 722.2651 761.7670 780.7540 783.0156 808.1213 833.4833 863.6240 893.5778 911.8850 915.4546 952.7304 968.4271 983.1580 989.3089 992.6518 1005.5065 1019.1944 1037.6630 1066.2749 1073.5708 1115.8075 1145.2784 1161.6982 1171.9221 1172.8835 1183.5995 1197.7647 1241.9584 1303.9620 1308.6488 1346.1416 1383.7813 1384.3000 1436.9924 1440.3354 1471.2290 1481.3288 1521.0948 1584.8049 1601.2103 1607.2658 1618.4460 1671.4710 3135.3364 3145.8549 3147.5133 3159.4223 3167.7941 3169.1856 3177.6617 3186.5096 3191.2186 3273.4626
redmass: 4.2532 5.9738 9.9873 6.4052 9.7642 5.2334 7.8118 6.4933 5.6557 6.9920 5.3510 8.7828 8.9646 6.3186 10.0725 2.8534 3.7629 3.7020 8.7210 3.4390 7.1557 6.5391 6.2944 8.1027 5.6272 5.7728 9.7857 1.7763 4.7349 6.2646 2.1350 1.3571 7.7112 1.2477 5.8048 1.3616 1.1121 1.4929 7.7917 1.3785 1.3405 6.2346 1.3270 1.3182 2.0974 2.9252 2.9910 1.4991 3.6008 1.8620 1.6040 1.0553 1.4062 1.7875 3.3605 1.6567 1.3223 2.5336 3.5795 4.5989 10.2061 2.9438 2.2089 2.2815 2.8457 2.5563 4.3656 6.0946 6.9489 6.3572 8.8336 1.0852 1.0893 1.0880 1.0934 1.0920 1.0969 1.1012 1.0941 1.0983 1.0790
irintensity: 0.0142 0.0777 3.9518 1.0041 0.0499 0.1705 6.1659 1.6137 0.7448 14.9513 0.4321 0.0207 2.2757 2.7884 2.6734 0.0128 0.9518 11.8262 5.2380 11.7728 0.6121 0.1357 5.9289 3.9785 13.9564 0.4566 2.7993 44.1687 12.0037 4.5341 64.4036 76.8540 11.8803 0.0001 3.3521 4.9073 98.9901 4.7438 211.8582 0.1005 4.6886 8.2402 0.6872 1.3510 40.6200 20.1381 16.5143 10.9880 551.2919 100.8743 72.2472 0.0305 232.7730 58.4759 284.5498 118.0898 0.1059 93.9395 435.7781 72.1751 1.0621 38.5961 4.5922 130.1574 58.8256 397.9525 299.5830 7.7619 5.8783 140.4167 216.2861 0.2742 8.7763 7.6218 29.4984 7.5521 14.2583 6.2527 5.3360 11.9448 157.3386
temp: 298.150 k
press: 1.00000 atm
elementType: 8 8 8 8 7 7 6 6 6 6 6 6 6 6 6 6 6 6 6 1 1 1 1 1 1 1 1 1 1
symmnumber: 1
zpe: 549672.4 jmol-1
zpe.correction: 0.209359 hartree
zpe.thermalcorrener: 0.224212 hartree
zpe.thermalcorrenthalpy: 0.225156 hartree
zpe.thermalcorrgfe: 0.165213 hartree
zpe.sumelectzpe: -910.383222 hartree
zpe.sumelectthermal: -910.368369 hartree
zpe.sumelectthermalent: -910.367425 hartree
zpe.sumelectthermalfe: -910.427367 hartree
dipole: 0.7951 3.3600 0.0038
dipole: 3.4528
quadrupole: -88.3273 -119.9335 -102.7152
quadrupole: -16.8213 -0.0141 -0.0360
quadrupole: 15.3313 -16.2748 0.9435 -16.8213 -0.0141 -0.0360
hfenergy: -910.5925807 hartree
pointgroup: C01 [X(C13H10N2O4)]
dipole: 0.3112821 -1.3223052 0.0008522 debye
polarizability: 276.9147893|-4.7146311|158.9513472|0.0044789|-0.1526833|107.0222352 unknown
InChI: InChI=1S/C13H10N2O4/c16-13(19-10-6-2-1-3-7-10)14-11-8-4-5-9-12(11)15(17)18/h1-9,14H
charge 0 multiplicity 1
29 atoms
O  1.554722 0.680511 -0.000555
O  0.922755 -1.597655 0.002378
O  -4.279327 2.361661 -0.002419
O  -2.009373 2.426949 -0.003257
N  -0.641093 0.199744 -0.000183
N  -3.139151 1.762951 -0.002533
C  -1.878153 -0.457866 0.000215
C  -3.107262 0.29275 -0.000933
C  -1.97998 -1.88106 0.001786
C  -4.366886 -0.360442 -0.000638
C  -3.233604 -2.512256 0.002097
C  -4.436547 -1.759361 0.000867
C  2.953032 0.351496 -0.000345
C  0.621713 -0.385304 0.001028
C  3.624657 0.238713 -1.2320
C  3.623811 0.235488 1.231482
C  5.017676 -0.000173 -1.224916
C  5.016821 -0.003414 1.224734
C  5.71437 -0.121415 -0.000009
H  -1.058513 -2.466668 0.00276
H  -5.265953 0.260721 -0.001564
H  -0.697765 1.235982 -0.001611
H  -3.274701 -3.606675 0.003282
H  -5.408212 -2.261371 0.001083
H  3.068162 0.340677 -2.168552
H  3.066692 0.334945 2.167932
H  5.555625 -0.089792 -2.174567
H  5.55411 -0.095563 2.174517
H  6.793674 -0.30687 0.00012
