program: Gaussian 09
title: 000298751
version: EM64L-G09RevD.01
frameworkgroup: C1[X(C8H8N2O4)]
method: RPBEPBE
basis: SDD
operation: Freq
keyword: #pfreq=noraman
keyword: PBEPBE/SDD
title: #p freq=noraman PBEPBE/SDD
converged: NO YES NO YES
title: Mulliken charges:
elementType: O O O O N N C C C C C C C C H H H H H H H H
charge: -0.287169 -0.197924 -0.254468 -0.267073 -0.449704 0.028759 0.356024 0.191463 -0.315149 -0.331513 -0.219288 -0.224558 0.263443 -0.491985 0.314199 0.288034 0.384703 0.240248 0.243331 0.244074 0.244078 0.240475
chargesum: 0.00000
title: Mulliken charges with hydrogens summed into heavy atoms:
elementType: O O O O N N C C C C C C C C
charge: -0.287169 -0.197924 -0.254468 -0.267073 -0.065001 0.028759 0.356024 0.191463 -0.000951 -0.043479 0.020960 0.018773 0.263443 0.236643
polarizability: 1.85888476e+02 -2.43459629e+00 1.45577609e+02 -3.02764662e-03 6.01994148e-03 5.00055500e+01
1716.lowfreq: -13.8758 -8.9911 -4.7916 -0.0005 -0.0003 0.0005 29.8339 51.0894 63.1137
frequency: 28.9729 51.0055 63.1092 101.3332 112.8198 130.4844 175.9016 237.2819 276.8414 277.5676 330.7470 345.5197 415.3997 424.3164 523.4826 525.9148 599.7128 658.2406 663.6818 683.4309 699.0110 721.9006 781.6074 782.6667 841.8316 892.9789 901.5609 908.2419 982.8995 1005.4748 1022.3804 1037.3438 1069.5071 1118.9663 1134.8169 1145.2540 1154.7304 1181.3569 1208.5123 1242.3717 1309.4013 1346.6366 1384.0413 1425.6439 1438.9631 1452.0455 1465.4242 1481.7850 1524.5875 1585.2004 1618.4445 1654.3352 3007.0601 3109.4098 3146.4380 3153.2633 3167.2495 3186.6342 3191.1384 3274.0923
redmass: 1.2087 5.2285 5.0685 5.8940 4.9966 4.1249 5.2385 6.2033 5.8125 5.4346 9.2678 6.9046 8.8085 3.7591 7.7430 3.4250 6.2871 8.1806 5.6309 6.0906 9.6022 4.7468 9.4162 1.3585 6.0039 1.3628 7.4787 1.1131 1.3397 1.3175 6.8120 2.9741 2.8753 1.2557 2.7143 1.7110 1.5839 1.2486 5.4367 1.6956 2.6080 3.4016 4.5583 1.2373 2.6324 1.0495 1.0594 2.8980 2.6055 4.1737 6.2755 7.3015 1.0297 1.1049 1.0881 1.1046 1.0919 1.0942 1.0981 1.0790
irintensity: 0.2163 0.1705 5.7917 0.0618 3.2972 0.8971 6.9117 10.3241 17.3571 1.7019 2.8594 4.7738 0.5640 1.0094 1.4575 12.5104 0.9887 5.4208 14.2461 6.1201 4.1818 12.4832 12.5230 79.7538 1.9168 6.2715 3.6830 108.1238 4.9331 1.6685 122.1277 7.8628 14.3431 0.2925 202.7682 106.3549 31.8152 79.6339 380.4972 107.3443 89.8156 363.3239 53.9777 18.7844 41.0646 15.0031 19.9168 77.5756 350.6284 297.2538 124.4265 185.4939 42.0443 26.2330 8.2854 13.6225 7.4965 4.7792 12.0624 143.1956
temp: 298.150 k
press: 1.00000 atm
elementType: 8 8 8 8 7 7 6 6 6 6 6 6 6 6 1 1 1 1 1 1 1 1
symmnumber: 1
zpe: 414990.4 jmol-1
zpe.correction: 0.158061 hartree
zpe.thermalcorrener: 0.170807 hartree
zpe.thermalcorrenthalpy: 0.171752 hartree
zpe.thermalcorrgfe: 0.117077 hartree
zpe.sumelectzpe: -718.963076 hartree
zpe.sumelectthermal: -718.950330 hartree
zpe.sumelectthermalent: -718.949385 hartree
zpe.sumelectthermalfe: -719.004060 hartree
dipole: 1.1164 3.1758 0.0020
dipole: 3.3663
quadrupole: -65.5272 -88.3789 -81.3545
quadrupole: -14.5473 -0.0001 -0.0040
quadrupole: 12.8930 -9.9587 -2.9343 -14.5473 -0.0001 -0.0040
hfenergy: -719.121137 hartree
pointgroup: C01 [X(C8H8N2O4)]
dipole: 0.4281169 -1.2532882 -0.0007759 debye
dipolederiv: -1.6992913 -0.2966214 0.0001046 -0.7891072 -0.6700089 0.0000814 0.0002548 0.0001003 -0.3182157 -0.8791778 0.3746279 -0.0002085 0.3312506 -0.6825603 0.0000329 0.0002346 -0.0002294 -0.2229118 -0.6043842 -0.3072496 -0.0000534 -0.0915071 -0.7041138 0.0000002 -0.0001682 -0.0003163 -0.2613111 -0.8652523 0.1084556 -0.0000226 0.3025402 -0.8913183 0.0001412 -0.0000087 0.0000228 -0.3368357 -2.4062675 0.0660676 0.0000819 0.0863976 -0.4374974 -0.0000217 0.0000129 -0.0000126 -0.2974145 1.1514828 -0.109676 0.000299 -0.4962665 1.8274615 0.0001653 -0.0000085 0.0004554 0.2049251 1.3050476 -0.0599134 -0.0000613 0.929707 0.351398 -0.0000032 -0.0000436 0.0000044 0.1367986 -0.2184415 -0.0619149 -0.0000193 0.4471321 -0.8941838 -0.0001319 -0.0000288 -0.0000212 -0.0033547 -0.3378042 -0.0942449 0.0000111 -0.6346149 -0.1977673 0.0000017 0.0000477 -0.0000186 -0.1619829 -0.1151596 0.3225714 0.0000421 -0.2486256 0.3214515 -0.000003 -0.0000391 0.0001392 -0.086812 0.4561081 -0.1877303 -0.0000027 0.0230111 0.2706233 -0.0000146 0.0000488 -0.0000139 -0.0997052 -0.1229817 0.2226543 0.0000162 0.3592477 -0.3951939 -0.0000199 -0.0000306 0.0000286 -0.1725076 2.9183465 0.0508869 -0.000064 -0.0719331 1.364195 -0.0002297 -0.0000968 -0.0001496 0.3299998 0.9076377 0.0804228 -0.0000614 -0.0467955 0.2112348 0.0000202 -0.0000419 0.0000074 0.2821598 0.1345213 0.0632206 -0.0000083 0.0290639 0.1078588 -0.0000019 -0.0000229 -0.000004 0.1790637 0.0757562 0.0112221 -0.0000106 0.0740639 0.0992961 0.0000125 0.0000026 -0.0000057 0.16837 0.3284535 -0.0113314 -0.0000412 -0.1819925 0.3001226 -0.0000151 -0.0001157 0.0000289 0.326303 0.1019012 -0.0013726 -0.0000039 -0.016422 -0.090099 0.0000065 -0.0000089 0.0000182 0.1505222 -0.0533054 -0.0812856 -0.0000105 -0.0717257 0.0433611 -0.0000075 0.0000116 -0.0000339 0.1663732 -0.0363503 -0.0125384 0.0036039 0.0977 0.0572311 -0.1004359 0.0544567 -0.0781787 -0.0553626 -0.0363435 -0.0125167 -0.0036113 0.0977154 0.0572751 0.1003933 -0.0544869 0.0781528 -0.0553836 -0.0044955 -0.0637339 0.0000201 -0.1288395 -0.048766 0.0000292 0.000031 0.0000262 0.1272821 unknown
polarizability: 185.9285277|2.076327|145.5375574|0.003081|0.0059928|50.00555 unknown
InChI: InChI=1S/C8H8N2O4/c1-14-8(11)9-6-4-2-3-5-7(6)10(12)13/h2-5,9H,1H3
charge 0 multiplicity 1
22 atoms
O  3.180028 0.802754 0.000045
O  -2.700253 2.36175 0.000403
O  -0.433633 2.483662 0.000988
O  2.596221 -1.47082 0.000355
N  0.989774 0.29147 0.000191
N  -1.546377 1.789867 0.00011
C  -0.229139 -0.396891 0.000173
C  -1.477377 0.323431 0.000066
C  -0.29524 -1.822655 0.000235
C  -2.720095 -0.362411 0.000002
C  -1.532454 -2.484769 0.000169
C  -2.754456 -1.762172 0.000046
C  2.269619 -0.258477 0.000305
C  4.604919 0.405427 -0.000059
H  0.641643 -2.382956 0.000305
H  -3.634538 0.235892 -0.000071
H  0.903611 1.325528 -0.000018
H  -1.54639 -3.579959 0.000207
H  -3.713187 -2.288581 0.000002
H  4.836542 -0.188885 -0.899593
H  4.836726 -0.188688 0.899559
H  5.156055 1.355683 -0.000221
