program: Gaussian 09
title: 000298757
version: EM64L-G09RevD.01
frameworkgroup: C1[X(C14H12N2O5)]
method: RPBEPBE
basis: SDD
operation: Freq
keyword: #p
keyword: freq=noraman
keyword: PBEPBE/SDD
title: #p freq=noraman PBEPBE/SDD
converged: NO YES NO NO
title: Mulliken charges:
elementType: O O O O O N N C C C C C C C C C C C C C C H H H H H H H H H H H H
charge: -0.314843 -0.264402 -0.262783 -0.197191 -0.256143 -0.453880 0.028660 0.360016 0.181284 -0.304755 0.361829 -0.331745 -0.222253 -0.225101 0.319778 -0.380481 -0.306403 -0.321198 -0.335788 0.236590 -0.537249 0.312949 0.386267 0.288202 0.240158 0.243473 0.263269 0.298327 0.257527 0.243610 0.247197 0.222456 0.222622
chargesum: 0.00000
title: Mulliken charges with hydrogens summed into heavy atoms:
elementType: O O O O O N N C C C C C C C C C C C C C C
charge: -0.314843 -0.264402 -0.262783 -0.197191 -0.256143 -0.067613 0.028660 0.360016 0.181284 0.008194 0.361829 -0.043543 0.017905 0.018371 0.319778 -0.117213 -0.008075 -0.063671 -0.092178 0.236590 0.155026
polarizability: 3.92048758e+02 2.81021924e-01 2.08747878e+02 2.38692382e-01 4.77971420e-02 7.50610220e+01
1716.lowfreq: -8.7852 -3.4032 -0.8713 -0.0007 -0.0002 0.0006 15.1375 24.7511 51.9981
frequency: 15.0616 24.7473 51.9781 54.8770 64.8889 98.9436 111.9461 132.9560 149.3597 174.7223 197.9068 234.2462 241.3596 275.9360 297.2880 333.1690 338.1069 367.8241 397.8788 417.2813 424.4936 440.4145 505.9821 513.3189 525.7228 526.7546 596.4728 619.8652 651.8928 662.6661 680.7979 711.8065 712.1522 721.5164 724.9104 780.3956 782.3618 810.1720 814.3334 833.6862 864.4935 892.9857 914.4804 947.9979 961.2602 969.1119 982.8785 987.7367 1000.5009 1005.1985 1036.1397 1066.4890 1109.0958 1114.1839 1124.8694 1146.4665 1153.4194 1162.2676 1175.7135 1181.4640 1196.6448 1236.3674 1242.1454 1295.2376 1308.9635 1344.3739 1379.1413 1383.4324 1422.5222 1436.0862 1438.1525 1468.3370 1472.3042 1480.7084 1487.1892 1521.1836 1584.4821 1590.1651 1616.7786 1618.1735 1650.5693 2960.6122 3048.7286 3127.3158 3147.0350 3160.4768 3161.8416 3167.1817 3180.8476 3188.2259 3194.2893 3206.8702 3266.8290
redmass: 3.9208 6.7719 6.8355 12.6702 6.6381 4.6422 4.7535 6.3074 5.6261 4.4847 6.5508 4.3358 1.2156 5.2526 8.2762 8.8334 6.6620 6.4180 9.6396 3.0914 3.7581 5.6104 5.3287 2.5221 3.4093 7.5650 6.6821 7.1966 7.6653 5.6889 9.8464 6.6460 3.9047 4.7478 7.8270 7.5961 1.3522 1.2673 7.3393 1.6284 6.5359 1.3606 1.1148 1.3302 1.3341 8.1259 1.3401 8.7279 2.5982 1.3167 2.9036 2.9607 1.3152 1.2587 2.9884 1.8796 1.4271 1.7700 1.3929 1.5837 3.6623 3.3930 1.9088 1.2748 2.6797 3.2900 6.8242 4.7227 3.8447 2.4414 1.2919 1.0495 1.1365 2.8744 2.0492 2.6088 4.3824 7.5038 6.2925 6.2942 8.3501 1.0331 1.1040 1.0994 1.0880 1.0885 1.0899 1.0923 1.0977 1.0954 1.0965 1.0944 1.0791
irintensity: 0.0807 0.5132 0.4852 3.8587 0.0095 4.6555 0.4151 8.0564 0.0917 5.4829 4.8908 1.0983 0.4742 1.1549 0.6313 12.0669 2.2407 0.1507 8.1222 0.0769 1.0004 1.6657 18.8107 14.5458 16.6692 0.0863 8.2984 1.5165 5.7953 14.9491 4.0651 7.7109 1.1726 10.8067 3.8528 8.1139 76.2150 7.6370 4.4230 94.9640 2.3266 4.7843 108.2655 4.0757 0.1961 70.7390 5.2189 57.1575 70.3596 1.7821 21.3009 7.0648 50.6748 0.1739 455.1009 191.9034 15.9966 59.0773 286.4559 324.2530 349.6396 86.3371 80.8587 1.5259 128.8614 438.0742 7.3353 76.9329 3.2506 44.4245 18.6389 13.9483 183.1129 120.3341 291.9622 193.5850 222.4572 31.5845 12.9114 203.3593 159.1533 77.0736 48.6925 26.9872 7.5238 8.9810 8.2889 9.6103 3.1101 3.9932 13.7308 4.7166 137.6001
temp: 298.150 k
press: 1.00000 atm
elementType: 8 8 8 8 8 7 7 6 6 6 6 6 6 6 6 6 6 6 6 6 6 1 1 1 1 1 1 1 1 1 1 1 1
symmnumber: 1
zpe: 632825.5 jmol-1
zpe.correction: 0.241030 hartree
zpe.thermalcorrener: 0.259375 hartree
zpe.thermalcorrenthalpy: 0.260320 hartree
zpe.thermalcorrgfe: 0.191908 hartree
zpe.sumelectzpe: -1024.736276 hartree
zpe.sumelectthermal: -1024.717931 hartree
zpe.sumelectthermalent: -1024.716987 hartree
zpe.sumelectthermalfe: -1024.785399 hartree
dipole: -1.4073 -4.6517 0.0217
dipole: 4.8600
quadrupole: -93.9692 -122.1902 -124.5417
quadrupole: -9.0306 -0.0175 -0.0484
quadrupole: 19.5978 -8.6232 -10.9747 -9.0306 -0.0175 -0.0484
hfenergy: -1024.9773063 hartree
pointgroup: C01 [X(C14H12N2O5)]
dipole: 0.560187 -1.5567928 0.9584231 debye
polarizability: 390.8062007|10.5079407|174.0095153|16.7922093|-58.2599255|111.0419425 unknown
InChI: InChI=1S/C14H12N2O5/c1-20-10-6-8-11(9-7-10)21-14(17)15-12-4-2-3-5-13(12)16(18)19/h2-9,15H,1H3
charge 0 multiplicity 1
33 atoms
O  0.809687 0.475321 -0.280216
O  6.430781 0.537567 0.048661
O  0.120967 -1.498813 0.841676
O  -4.926819 1.873485 -1.562717
O  -2.661055 1.945582 -1.421609
N  -1.374004 0.038491 -0.186034
N  -3.811335 1.364445 -1.169494
C  -2.62654 -0.536627 0.057644
C  -3.827618 0.101433 -0.419306
C  -2.776824 -1.761028 0.775563
C  2.226011 0.359212 -0.116545
C  -5.105369 -0.468995 -0.182802
C  -4.047747 -2.311444 1.001411
C  -5.222259 -1.67175 0.524716
C  5.034267 0.412011 0.034194
C  2.940027 1.427184 -0.709816
C  2.898284 -0.684043 0.553471
C  4.340579 1.454119 -0.635026
C  4.311103 -0.651507 0.625861
C  -0.127467 -0.450718 0.199395
C  7.198831 -0.511432 0.724225
H  -1.876921 -2.257091 1.142814
H  -1.404463 0.929264 -0.717794
H  -5.98067 0.059245 -0.568743
H  -4.126208 -3.252439 1.556341
H  -6.208095 -2.109573 0.705843
H  2.385971 2.219771 -1.220808
H  2.339476 -1.502219 1.008631
H  4.916891 2.267353 -1.084953
H  4.825739 -1.463808 1.146841
H  8.251213 -0.211729 0.614758
H  6.938302 -0.572567 1.798883
H  7.039968 -1.4978 0.246236
