program: Gaussian 09
title: 000298760
version: EM64L-G09RevD.01
frameworkgroup: C1[X(C16H16ClNO4)]
method: RPBEPBE
basis: SDD
operation: Freq
keyword: #p
keyword: freq=noraman
keyword: PBEPBE/SDD
title: #p freq=noraman PBEPBE/SDD
converged: YES YES NO NO
title: Mulliken charges:
elementType: Cl O O O O N C C C C C C C C C C C C C C C C H H H H H H H H H H H H H H H H
charge: -0.063338 -0.301051 -0.303584 -0.298081 -0.283534 -0.459141 0.531368 -0.489224 -0.499660 0.228366 -0.408970 0.187222 -0.339951 0.491551 0.287166 -0.432581 -0.337619 -0.183813 -0.194334 -0.120125 -0.529264 -0.530087 0.226740 0.247081 0.290361 0.236017 0.251617 0.332186 0.229950 0.304935 0.255105 0.254678 0.250224 0.224511 0.232403 0.258343 0.223894 0.230638
chargesum: 0.00000
title: Mulliken charges with hydrogens summed into heavy atoms:
elementType: Cl O O O O N C C C C C C C C C C C C C C C C
charge: -0.063338 -0.301051 -0.303584 -0.298081 -0.283534 -0.126955 0.531368 -0.015403 -0.209298 0.228366 -0.172954 0.187222 -0.088333 0.491551 0.287166 -0.202631 -0.032684 0.071293 0.060344 -0.120125 0.177874 0.182788
polarizability: 2.83557042e+02 2.03910628e+01 1.92315112e+02 3.85581405e+00 2.07090584e+01 1.61989793e+02
1716.lowfreq: -0.6875 -0.0008 0.0013 0.0018 4.3298 7.9819 14.6386 21.3953 29.6818
frequency: 14.5898 21.0921 29.6628 47.7495 66.6848 78.1308 93.5623 101.0820 110.8945 138.2786 155.3140 166.2582 169.2496 196.5162 212.1437 223.3120 256.2256 260.1876 298.3800 329.5444 343.5166 348.6790 374.0886 411.6284 412.5684 420.8250 479.8865 487.9387 505.2222 514.1756 575.9650 618.2767 633.6388 640.6515 662.1692 682.4226 697.0566 703.1767 708.5719 727.4905 758.2433 812.0334 814.0182 839.4637 841.3254 876.9246 886.3674 928.9036 937.1894 945.2910 953.1591 962.0450 973.8404 982.7438 994.6683 1002.4934 1074.4141 1095.6816 1113.3635 1114.8639 1116.0409 1142.3142 1154.1471 1156.7854 1159.9366 1185.4469 1200.3940 1238.3475 1247.0763 1261.0348 1273.5628 1296.9606 1347.3539 1370.8445 1372.8062 1402.5469 1403.7059 1424.4281 1443.8917 1458.2308 1460.0822 1462.4622 1477.2691 1479.1486 1485.5093 1488.1992 1510.0221 1575.0675 1595.4446 1610.3123 1612.2575 1658.7590 2971.7744 2976.0940 3036.7046 3067.2663 3074.4581 3111.2528 3122.0124 3124.9913 3126.3182 3131.8980 3155.6436 3164.2669 3164.9245 3172.1060 3192.2207 3542.3417
redmass: 7.6233 4.6850 4.2799 7.3834 4.0789 8.2805 6.3844 3.8708 2.8527 4.6881 2.9385 1.1158 1.2751 6.1227 6.6158 5.0350 6.0593 5.8702 5.0953 5.7214 3.7537 4.3600 4.9634 3.0905 4.7435 5.4402 4.9926 4.1356 2.7267 4.9065 4.7712 6.8826 4.7584 1.3897 5.0683 6.3901 4.8049 3.7896 5.7472 4.7311 3.8974 3.8672 1.3823 1.7799 1.4234 4.8722 5.5615 1.5436 1.3561 6.9237 1.5732 2.8034 1.3209 5.4254 4.0166 2.3347 2.6193 2.7372 1.2431 1.2439 1.3268 1.4614 1.3272 1.6667 2.9111 1.1145 1.8068 1.1874 2.4058 2.0968 2.1365 1.3417 1.2978 6.6187 4.8514 2.2250 3.9852 1.1800 1.3891 1.0564 1.0697 1.1216 1.0759 2.2667 2.7221 1.0624 2.4152 7.1791 5.6609 6.3049 6.5521 8.0207 1.0307 1.0312 1.0589 1.1044 1.1034 1.1073 1.1024 1.1032 1.0902 1.0892 1.0926 1.0959 1.0908 1.0954 1.0955 1.0762
irintensity: 0.0230 0.3179 1.4394 0.2775 3.0761 5.2597 2.6472 3.5508 5.6724 0.7180 1.6201 0.3067 0.3614 1.0896 9.1992 8.6603 7.2835 5.8045 2.0116 0.3231 14.5545 0.3173 13.9894 0.9771 16.8524 3.3310 5.1025 14.3809 37.6746 9.9533 12.0275 7.0791 27.2128 32.5019 14.0646 10.3345 38.9821 6.1494 13.1190 22.3381 3.9514 37.7076 44.4875 22.0919 61.3744 1.3196 29.8946 30.6551 1.3284 58.9437 30.2501 155.7000 2.0452 238.4613 0.9344 100.1538 60.1818 67.5240 18.4456 1.2834 29.7366 2.7561 5.6894 67.3191 372.8308 12.6562 21.8596 10.1121 141.6252 6.1527 76.9087 16.8418 30.5397 16.2708 102.6963 23.1603 33.0059 0.8752 21.6980 15.5420 4.9732 29.0877 12.4653 33.6134 96.9486 35.2457 740.5978 9.4478 30.5306 54.0460 12.7385 210.3218 77.6705 62.7529 35.6417 28.7630 23.4001 6.1928 21.2467 23.6922 13.3588 10.3993 0.7691 9.1887 2.4866 2.9156 5.3452 32.5192
temp: 298.150 k
press: 1.00000 atm
elementType: 17 8 8 8 8 7 6 6 6 6 6 6 6 6 6 6 6 6 6 6 6 6 1 1 1 1 1 1 1 1 1 1 1 1 1 1 1 1
symmnumber: 1
zpe: 759799.2 jmol-1
zpe.correction: 0.289392 hartree
zpe.thermalcorrener: 0.310875 hartree
zpe.thermalcorrenthalpy: 0.311819 hartree
zpe.thermalcorrgfe: 0.235682 hartree
zpe.sumelectzpe: -1433.387506 hartree
zpe.sumelectthermal: -1433.366023 hartree
zpe.sumelectthermalent: -1433.365079 hartree
zpe.sumelectthermalfe: -1433.441216 hartree
dipole: 2.9981 1.4155 1.8392
dipole: 3.7914
quadrupole: -144.7168 -124.6564 -126.3187
quadrupole: -11.6653 -5.5351 4.8324
quadrupole: -12.8195 7.2409 5.5786 -11.6653 -5.5351 4.8324
hfenergy: -1433.676898 hartree
pointgroup: C01 [X(C16H16Cl1N1O4)]
dipole: -0.9524166 -1.010601 0.544662 debye
polarizability: 265.3022889|40.3987499|217.7573353|8.0665881|-9.6919749|154.8023229 unknown
InChI: InChI=1S/C16H16ClNO4/c1-20-14-8-3-11(9-15(14)21-2)10-22-16(19)18-13-6-4-12(17)5-7-13/h3-9,18H,10H2,1-2H3
charge 0 multiplicity 1
38 atoms
Cl 6.384863 3.647302 0.770629
O  0.618368 -2.122358 -0.565738
O  -3.8589 1.202562 -0.500037
O  -5.432587 -0.639691 1.14607
O  0.947091 -0.098414 -1.739972
N  2.28316 -0.760179 0.104802
C  -1.860992 -1.940386 -0.765973
C  -0.585008 -2.414387 -1.422121
C  -2.29206 -0.598938 -0.925207
C  -3.477264 -0.147255 -0.312583
C  -2.649981 -2.831114 0.004891
C  -4.238296 -1.035764 0.505297
C  -3.826321 -2.379446 0.63945
C  3.221489 0.299766 0.216101
C  1.261295 -0.89691 -0.821222
C  4.182081 0.215497 1.259747
C  3.23338 1.417261 -0.660825
C  5.145641 1.229039 1.432475
C  4.199104 2.431601 -0.487487
C  5.141546 2.328623 0.55265
C  -5.130821 1.382481 -1.239534
C  -5.283173 0.457996 2.132577
H  -0.557204 -3.510586 -1.52133
H  -0.419117 -1.932562 -2.401007
H  -1.710407 0.106135 -1.528726
H  -2.336109 -3.874919 0.122074
H  -4.43898 -3.047538 1.252988
H  2.352987 -1.525743 0.778786
H  4.180688 -0.643288 1.942022
H  2.494673 1.485556 -1.461648
H  5.88367 1.161799 2.236642
H  4.211659 3.293841 -1.1605
H  -5.965845 0.873486 -0.724421
H  -5.029049 0.988628 -2.268467
H  -5.300101 2.469457 -1.26971
H  -4.826553 1.349845 1.668265
H  -4.661808 0.117122 2.982109
H  -6.304219 0.67798 2.479033
