program: Gaussian 09
title: 000027130
version: EM64L-G09RevD.01
frameworkgroup: C1[X(C15H21FN2)]
method: RPBEPBE
basis: SDD
operation: Freq
keyword: #p
keyword: freq=noraman
keyword: PBEPBE/SDD
title: #p freq=noraman PBEPBE/SDD
converged: NO YES NO NO
title: Mulliken charges:
elementType: F N N C C C C C C C C C C C C C C C H H H H H H H H H H H H H H H H H H H H H
charge: -0.204423 -0.079207 -0.016051 0.258013 -0.076427 -0.483543 0.404597 -0.385445 -0.726025 -0.740633 -0.314541 -0.344912 -0.357347 -0.619542 -0.622217 -0.383674 -0.403272 0.320953 0.207275 0.250497 0.209507 0.203519 0.239473 0.214312 0.236009 0.238344 0.243266 0.217028 0.228494 0.260494 0.232977 0.221152 0.232790 0.188565 0.222017 0.224395 0.189209 0.258168 0.256206
chargesum: 0.00000
title: Mulliken charges with hydrogens summed into heavy atoms:
elementType: F N N C C C C C C C C C C C C C C C
charge: -0.204423 -0.079207 -0.016051 0.258013 0.130848 -0.023538 0.404597 0.057546 -0.037361 -0.051845 -0.314541 -0.084418 -0.124370 0.022965 0.013403 -0.125506 -0.147066 0.320953
polarizability: 1.78168079e+02 -1.90095374e+01 1.63439584e+02 1.90373760e+00 7.60027650e+00 1.61618609e+02
1716.lowfreq: -13.7465 -6.7045 -0.0008 -0.0006 -0.0005 5.1182 14.2055 33.9578 41.9427
frequency: -8.0947 33.7995 41.8632 63.1689 79.9827 86.4165 119.0279 127.4145 140.7379 169.3640 200.8569 209.0537 219.0800 227.1196 232.3325 241.9682 267.8403 312.0342 334.2316 340.8337 353.0528 397.9208 403.8652 411.9241 413.4726 447.3957 451.2598 471.7601 527.8464 573.6816 607.9841 628.7505 660.1587 726.8345 772.1002 797.2295 812.5463 817.9697 830.1407 864.6403 905.4667 921.8528 939.7416 953.7596 956.2777 966.1339 1003.2509 1016.7524 1032.3536 1037.5626 1057.6204 1084.0402 1093.4486 1109.6472 1126.0081 1132.8386 1143.2339 1159.0589 1171.7221 1177.9460 1208.8500 1213.3250 1255.7823 1263.9149 1287.6299 1301.2684 1305.9328 1313.4762 1323.0743 1370.4671 1379.8305 1385.0557 1400.4768 1405.0038 1417.7124 1442.3868 1460.3288 1462.5479 1468.5300 1470.8284 1473.0441 1476.5474 1480.4771 1484.4489 1488.8399 1490.8707 1493.3530 1599.6359 1610.9496 2180.0751 2846.9976 2855.8141 2872.1489 2979.0866 2981.8224 2984.4704 3002.6000 3020.7720 3021.4088 3027.6464 3072.0018 3076.7311 3078.6531 3080.5962 3083.4988 3086.9385 3089.4445 3136.2445 3146.6794 3173.3997 3176.7383
redmass: 2.5755 4.7839 3.6421 2.6978 3.9142 3.8589 3.1527 5.8200 4.0136 4.6842 1.4529 1.4093 1.4571 1.2544 1.6211 1.7515 2.3081 3.6323 4.2961 3.0273 2.5535 4.2537 3.3797 3.0524 3.1826 2.7312 3.6227 3.6668 2.7868 7.7080 3.1872 7.2546 4.5048 3.7257 1.9240 2.4179 4.3993 1.3318 1.7088 2.6908 2.1976 1.1765 1.5707 1.4842 1.8258 1.4847 3.2756 2.9725 1.7052 2.2144 1.7883 1.5512 2.0440 1.4423 1.5027 2.1523 1.9086 1.5943 2.3154 2.0549 1.9879 2.7194 1.8932 2.1191 1.3487 1.2776 1.3792 1.2997 1.3608 5.1652 1.3460 1.2584 1.2222 3.2975 1.1429 1.1655 1.0551 1.0695 1.0530 1.0448 1.0560 1.0505 1.0699 1.0510 1.0768 1.0716 2.3396 7.6627 6.3643 12.6440 1.0572 1.0615 1.0644 1.0826 1.0368 1.0363 1.0653 1.0845 1.0729 1.0718 1.0997 1.1001 1.0997 1.1003 1.1005 1.0990 1.0989 1.0890 1.0897 1.0954 1.0961
irintensity: 0.5946 0.1559 0.0305 0.1743 1.2068 2.4683 2.0893 2.3447 1.1195 0.1931 0.3978 0.1174 0.7657 0.1165 0.3868 0.9239 1.1529 1.6331 2.0713 7.2740 3.0185 1.8618 0.4794 0.0983 0.3873 0.1515 0.9773 2.1314 20.6112 11.8764 1.1616 0.0766 9.5650 3.1767 21.3049 10.3178 2.0601 13.4564 59.7466 11.2791 6.0123 4.8619 0.5618 0.6963 4.7059 1.3041 16.1630 1.4591 29.3883 24.0895 3.5377 4.8241 10.5634 7.3612 20.8884 0.8691 17.7659 45.7629 1.7166 7.8728 41.5513 9.1454 6.2602 9.0169 0.2260 3.1869 0.2021 13.2198 2.5790 2.0754 4.2380 19.7614 22.2324 2.0254 3.1347 2.2694 10.0089 17.8949 0.9725 0.3677 10.2853 15.8991 10.5423 19.8457 19.1946 16.4959 107.4424 5.3192 13.5905 6.7930 65.9128 84.0827 166.1930 17.8239 22.4759 22.3680 7.2585 22.8487 39.2307 46.1339 3.4812 34.5475 10.2681 62.5635 42.7264 41.6957 24.5967 11.2349 1.5977 3.0834 2.6238
temp: 298.150 k
press: 1.00000 atm
elementType: 9 7 7 6 6 6 6 6 6 6 6 6 6 6 6 6 6 6 1 1 1 1 1 1 1 1 1 1 1 1 1 1 1 1 1 1 1 1 1
symmnumber: 1
zpe: 856016.2 jmol-1
zpe.correction: 0.326039 hartree
zpe.thermalcorrener: 0.344947 hartree
zpe.thermalcorrenthalpy: 0.345891 hartree
zpe.thermalcorrgfe: 0.279153 hartree
zpe.sumelectzpe: -792.131935 hartree
zpe.sumelectthermal: -792.113027 hartree
zpe.sumelectthermalent: -792.112083 hartree
zpe.sumelectthermalfe: -792.178822 hartree
dipole: -0.5906 -0.6970 -3.3648
dipole: 3.4866
quadrupole: -118.6855 -111.5435 -109.6009
quadrupole: 9.6907 4.1297 -7.3421
quadrupole: -5.4089 1.7331 3.6758 9.6907 4.1297 -7.3421
hfenergy: -792.4579746 hartree
pointgroup: C01 [X(C15H21F1N2)]
dipole: 0.1757655 0.3145776 -1.3235589 debye
polarizability: 182.207672|-16.9884873|159.5342216|-1.6092191|-7.4844505|161.4843789 unknown
InChI: InChI=1S/C15H21FN2/c1-12(2)15(11-17,9-10-18(3)4)13-5-7-14(16)8-6-13/h5-8,12H,9-10H2,1-4H3
charge 0 multiplicity 1
39 atoms
F  -4.46595 1.946983 -0.016529
N  3.085122 1.868071 -0.162937
N  1.135457 -1.964644 2.359371
C  0.467275 -1.049519 -0.065127
C  0.280741 -2.317317 -1.018021
C  1.648247 -0.144551 -0.573525
C  -0.853656 -0.240014 -0.013609
C  1.878581 1.124163 0.274692
C  -0.874423 -3.227555 -0.540776
C  1.578829 -3.140281 -1.188516
C  0.823502 -1.54517 1.286639
C  -1.612062 -0.09434 1.174113
C  -1.33593 0.367399 -1.203477
C  3.575576 2.788957 0.884865
C  2.901811 2.564514 -1.453312
C  -2.822023 0.635785 1.185532
C  -2.540776 1.100006 -1.216072
C  -3.25985 1.217157 -0.013879
H  0.004708 -1.894842 -2.006407
H  2.587952 -0.722136 -0.56623
H  1.434164 0.119707 -1.626491
H  0.964857 1.770417 0.26049
H  2.040696 0.816841 1.325516
H  -1.02582 -4.051303 -1.261399
H  -0.641546 -3.679109 0.441577
H  -1.825447 -2.675299 -0.449088
H  1.947821 -3.508524 -0.21329
H  1.376818 -4.022093 -1.823409
H  2.388205 -2.564579 -1.669394
H  -1.260721 -0.552959 2.10434
H  -0.769859 0.277818 -2.137177
H  4.517735 3.260169 0.551812
H  3.785566 2.22241 1.809149
H  2.851647 3.60602 1.134589
H  2.652973 1.844004 -2.251472
H  3.844995 3.063589 -1.738342
H  2.094073 3.340724 -1.421646
H  -3.411339 0.751477 2.099638
H  -2.917851 1.570625 -2.128599
