program: Gaussian 09
title: 000298745
version: EM64L-G09RevD.01
frameworkgroup: C1[X(C14H13NO4)]
method: RPBEPBE
basis: SDD
operation: Freq
keyword: #p
keyword: freq=noraman
keyword: PBEPBE/SDD
title: #p freq=noraman PBEPBE/SDD
converged: YES YES NO NO
title: Mulliken charges:
elementType: O O O O N C C C C C C C C C C C C C C H H H H H H H H H H H H H
charge: -0.243197 -0.262448 -0.222320 -0.221310 0.020796 0.480795 -0.484031 -0.354335 -0.393949 0.349029 0.328514 -0.352373 -0.353031 -0.303474 -0.330940 0.375461 -0.365091 -0.335539 -0.537963 0.221446 0.221610 0.236923 0.231624 0.254835 0.243941 0.262777 0.264236 0.284044 0.287501 0.249157 0.222783 0.224529
chargesum: 0.00000
title: Mulliken charges with hydrogens summed into heavy atoms:
elementType: O O O O N C C C C C C C C C C C C C C
charge: -0.243197 -0.262448 -0.222320 -0.221310 0.020796 0.480795 -0.040975 -0.117412 -0.162325 0.349029 0.328514 -0.097538 -0.109090 -0.040697 -0.066704 0.375461 -0.081046 -0.048038 0.158506
polarizability: 3.29923847e+02 1.08596085e+01 1.36194150e+02 -1.40878877e+00 3.05627047e+00 1.16263144e+02
1716.lowfreq: -7.1936 -4.7547 -0.0007 -0.0004 -0.0003 2.8358 12.2461 22.4498 33.3537
frequency: 11.1183 22.3397 33.3323 65.5906 85.5029 92.0900 123.5203 138.7218 164.1889 211.7763 226.6756 236.2832 294.5307 315.1493 338.8152 382.6981 413.3852 419.6742 430.1615 451.6623 496.4093 509.7280 521.6352 535.8813 621.2126 627.4491 633.5287 665.6553 716.3222 731.9432 733.8191 769.2545 805.8677 814.5533 819.5749 825.9097 852.9412 859.1743 901.1985 943.1199 963.6833 970.6712 979.9760 986.8715 988.9587 993.5986 1002.9839 1096.9782 1111.4367 1111.7508 1116.4933 1155.9834 1166.8543 1178.9322 1199.2825 1223.8751 1227.7437 1230.6927 1242.1047 1293.3709 1306.3315 1350.8860 1357.9654 1389.7440 1400.4610 1421.9242 1436.8203 1437.1901 1467.8843 1470.9218 1472.1858 1480.8096 1507.2681 1585.0069 1585.8649 1610.8313 1626.4237 2963.2777 2974.5622 3039.5026 3053.0227 3127.5538 3129.6410 3132.3228 3164.6841 3166.6890 3168.1339 3171.6466 3185.0808 3189.6911
redmass: 4.2423 6.0464 5.9129 7.9687 5.3482 4.0087 6.1198 6.9394 4.1115 2.2543 3.2353 1.8047 6.0337 5.9134 2.7095 6.6997 2.9567 3.0421 5.5067 4.8610 3.0337 4.6958 4.1909 3.5357 6.7247 7.3647 6.7575 4.5902 3.6942 5.9029 4.8796 5.9260 2.9683 1.9601 1.2823 1.8899 1.6408 2.9450 6.6790 1.4539 1.3655 1.4965 1.5341 4.5709 1.4063 2.8977 2.6508 3.1691 1.2475 1.2604 1.3080 1.3314 1.4616 1.2205 1.0834 3.3221 3.7084 2.6363 4.3173 1.3014 1.2969 4.1159 1.6347 4.8969 7.3422 3.5696 1.8974 1.8148 1.0506 1.0697 1.5184 1.5679 2.6835 7.7613 7.0135 6.5592 6.4719 1.0329 1.0561 1.1082 1.1042 1.0908 1.0983 1.0901 1.0943 1.0880 1.0890 1.0957 1.0962 1.0972
irintensity: 0.6292 0.5047 0.2174 0.0670 0.7431 5.7730 0.3636 5.9020 4.0887 3.9113 1.9410 1.6191 0.1480 0.6340 1.4377 0.6569 0.0792 0.1073 0.0880 4.0701 9.5614 7.5090 27.9592 17.8178 4.9282 30.1281 10.2408 22.0186 2.1031 10.3244 5.4771 9.6723 28.5579 7.5734 6.4941 24.4005 70.1187 87.7894 265.0512 2.5127 0.5494 2.8214 5.9981 36.8640 3.9274 0.5584 4.0707 25.3739 26.2673 0.4306 12.1516 5.2808 479.8365 65.9911 5.9188 840.6634 36.1551 65.6430 72.0613 3.1076 0.5598 62.0818 84.9338 9.6126 54.6337 6.4572 5.4621 12.9098 15.1212 35.6676 61.2959 19.9981 87.1640 54.2874 10.0739 283.5586 82.4318 66.6867 29.6666 20.1250 45.7403 23.7551 14.4302 11.1636 13.0416 6.0787 1.2197 4.0701 3.8570 5.0357
temp: 298.150 k
press: 1.00000 atm
elementType: 8 8 8 8 7 6 6 6 6 6 6 6 6 6 6 6 6 6 6 1 1 1 1 1 1 1 1 1 1 1 1 1
symmnumber: 1
zpe: 636766.0 jmol-1
zpe.correction: 0.242531 hartree
zpe.thermalcorrener: 0.259515 hartree
zpe.thermalcorrenthalpy: 0.260459 hartree
zpe.thermalcorrgfe: 0.194490 hartree
zpe.sumelectzpe: -895.466258 hartree
zpe.sumelectthermal: -895.449275 hartree
zpe.sumelectthermalent: -895.448331 hartree
zpe.sumelectthermalfe: -895.514299 hartree
dipole: 8.6731 -1.2508 -1.4698
dipole: 8.8852
quadrupole: -143.9652 -107.3280 -104.5362
quadrupole: 3.4524 -12.4073 -0.7587
quadrupole: -25.3554 11.2818 14.0736 3.4524 -12.4073 -0.7587
hfenergy: -895.7087894 hartree
pointgroup: C01 [X(C14H13N1O4)]
dipole: 3.4078332 0.3747761 0.6828147 debye
polarizability: 329.7798411|-12.1013879|134.8611773|1.7929387|5.9114142|117.7401238 unknown
InChI: InChI=1S/C14H13NO4/c1-18-13-6-2-11(3-7-13)10-19-14-8-4-12(5-9-14)15(16)17/h2-9H,10H2,1H3
charge 0 multiplicity 1
32 atoms
O  -0.086755 -0.239118 -0.097328
O  6.262695 -0.440758 -0.391091
O  -6.356183 0.983965 0.293602
O  -6.362279 -1.239253 -0.227059
N  -5.748274 -0.12709 0.022701
C  2.184817 0.618421 0.055769
C  0.732308 0.990966 0.170103
C  2.838447 0.629145 -1.206033
C  2.927746 0.238859 1.197628
C  -1.47122 -0.123745 -0.049082
C  4.922004 -0.107654 -0.166661
C  4.191093 0.270448 -1.323124
C  4.288953 -0.124506 1.102052
C  -2.175429 1.078118 0.243906
C  -2.187371 -1.324412 -0.318594
C  -4.276516 -0.126678 -0.002731
C  -3.581655 1.072416 0.266284
C  -3.587241 -1.330099 -0.29644
C  7.069294 -0.841823 0.76593
H  0.483394 1.356329 1.185439
H  0.446326 1.759107 -0.574946
H  2.278742 0.916277 -2.104039
H  2.438273 0.220234 2.178948
H  4.704969 0.275539 -2.288787
H  4.835686 -0.412515 2.004437
H  -1.643676 2.009559 0.453308
H  -1.617142 -2.230827 -0.540444
H  -4.151033 1.978987 0.488085
H  -4.159534 -2.238693 -0.499834
H  8.068718 -1.05169 0.358454
H  7.133782 -0.026683 1.512404
H  6.66146 -1.753828 1.242939
