program: Gaussian 09
title: 000298729
version: EM64L-G09RevD.01
frameworkgroup: C1[X(C15H14O3)]
method: RPBEPBE
basis: SDD
operation: Freq
keyword: #pfreq=noraman
keyword: PBEPBE/SDD
title: #p freq=noraman PBEPBE/SDD
converged: YES YES NO NO
title: Mulliken charges:
elementType: O O O C C C C C C C C C C C C C C C H H H H H H H H H H H H H H
charge: -0.247270 -0.271434 -0.260417 -0.571056 0.467149 -0.269826 -0.429872 -0.364475 -0.219952 -0.229016 -0.241968 0.357880 0.292925 -0.325912 -0.391641 -0.205592 -0.194966 -0.246927 0.236415 0.210301 0.235667 0.246696 0.227990 0.259364 0.224750 0.225498 0.227818 0.302809 0.261490 0.230019 0.232569 0.230986
chargesum: 0.00000
title: Mulliken charges with hydrogens summed into heavy atoms:
elementType: O O O C C C C C C C C C C C C C C C
charge: -0.247270 -0.271434 -0.260417 -0.124340 0.467149 0.212537 -0.201882 -0.105111 0.004798 -0.003518 -0.014150 0.357880 0.292925 -0.023103 -0.130151 0.024427 0.037603 -0.015942
polarizability: 2.22291123e+02 1.69763661e+01 1.65890942e+02 -7.36875994e+00 -1.40347087e+01 1.11186900e+02
1716.lowfreq: -6.4723 -3.7720 -0.0006 -0.0005 -0.0002 4.5559 8.7765 17.5738 29.5131
frequency: 8.2415 17.2767 29.3958 43.2649 55.0670 93.3829 122.1430 168.3449 186.9696 242.9675 247.3021 310.9263 326.8495 347.1777 404.4478 410.1130 412.8035 488.6758 497.2177 563.5672 586.3712 606.7488 617.7849 681.4511 683.2984 692.6488 706.2012 751.3024 762.2974 768.9935 776.4142 817.8445 842.3862 855.6253 917.8159 921.5989 941.2394 967.1099 976.0003 978.2726 986.8706 990.6559 993.8723 996.0916 1001.0691 1026.6352 1029.4563 1064.1589 1081.5307 1089.2186 1158.0702 1164.7427 1170.8922 1172.0994 1184.8771 1191.2640 1197.9003 1217.7796 1236.0108 1312.5410 1329.1245 1341.9346 1361.9083 1382.9692 1385.4117 1440.8450 1443.8438 1454.5941 1466.5892 1471.5450 1486.1063 1592.5856 1593.5028 1609.6649 1615.6056 1628.5108 2995.3563 3010.3447 3052.0217 3083.8749 3113.3570 3125.8613 3133.9369 3138.7399 3145.3325 3152.3254 3162.5508 3165.0799 3176.3290 3204.2231
redmass: 4.8317 4.2930 4.0948 9.9733 6.6280 4.7460 5.1063 3.6323 4.3067 5.6662 5.1407 2.7325 4.6093 6.4538 2.8208 2.9490 2.5833 4.1576 3.1186 2.9819 7.1999 6.4099 6.3103 9.8341 8.4847 2.3974 1.7691 3.3465 1.4778 1.9085 6.0665 3.8171 1.2481 1.2470 1.3738 1.3908 3.0152 2.6891 1.3591 1.4113 6.2057 5.2769 1.3014 1.4390 3.0867 2.0272 2.1124 2.4405 1.5079 1.6662 2.9949 2.5027 1.0943 1.0596 1.1729 1.1489 1.7523 2.1195 1.1801 1.3215 1.2911 1.5028 1.3859 7.0713 9.1089 2.1287 2.2826 1.1134 1.1129 2.1775 2.2599 6.3436 6.0354 6.6195 6.1028 10.7791 1.0599 1.0590 1.1004 1.1083 1.0870 1.0866 1.0854 1.0924 1.0905 1.0957 1.0955 1.1009 1.0989 1.0947
irintensity: 0.0150 0.0266 0.0221 1.3878 0.7075 1.0541 1.1728 4.9369 1.5440 0.0597 9.7614 0.3964 2.7461 6.1138 0.1123 0.0507 5.0001 12.7911 10.9405 16.4343 0.6375 2.5126 0.4193 11.4779 3.6763 33.5438 62.2327 21.8743 93.5647 32.6332 22.3209 13.1659 0.0182 0.4007 2.9349 11.1287 19.0344 3.5636 0.0799 0.5231 2.5527 3.0246 1.5890 10.6813 50.0490 3.3905 10.5671 101.4523 14.5395 9.6060 547.5921 865.3388 7.6697 1.1882 1.2160 10.5418 134.3597 14.7523 9.1997 0.9782 3.1551 2.2055 10.4502 0.4792 15.0160 8.2631 10.1561 17.2709 18.5308 99.5638 19.0784 26.0333 1.5918 23.6831 5.5613 213.6088 17.8886 29.1937 16.4466 29.4692 9.1985 0.9706 0.1260 26.8147 17.5159 34.0262 26.0274 13.7560 7.2478 5.4747
temp: 298.150 k
press: 1.00000 atm
elementType: 8 8 8 6 6 6 6 6 6 6 6 6 6 6 6 6 6 6 1 1 1 1 1 1 1 1 1 1 1 1 1 1
symmnumber: 1
zpe: 660083.5 jmol-1
zpe.correction: 0.251413 hartree
zpe.thermalcorrener: 0.267320 hartree
zpe.thermalcorrenthalpy: 0.268264 hartree
zpe.thermalcorrgfe: 0.203248 hartree
zpe.sumelectzpe: -804.376962 hartree
zpe.sumelectthermal: -804.361055 hartree
zpe.sumelectthermalent: -804.360111 hartree
zpe.sumelectthermalfe: -804.425127 hartree
dipole: -0.2833 -0.0296 -0.2529
dipole: 0.3809
quadrupole: -88.5028 -96.7545 -106.1296
quadrupole: 8.4438 -2.1077 0.0774
quadrupole: 8.6262 0.3744 -9.0006 8.4438 -2.1077 0.0774
hfenergy: -804.6283746 hartree
pointgroup: C01 [X(C15H14O3)]
dipole: -0.1154188 0.0150872 0.0944054 debye
polarizability: 220.593048|-17.6007862|166.5227385|11.9872918|-15.4232768|112.2531773 unknown
InChI: InChI=1S/C15H14O3/c16-15(18-14-9-5-2-6-10-14)17-12-11-13-7-3-1-4-8-13/h1-10H,11-12H2
charge 0 multiplicity 1
32 atoms
O  -0.434613 0.986552 0.616005
O  1.562854 0.049552 0.581046
O  1.19961 2.002882 -0.720427
C  -2.761658 1.67729 0.824494
C  -3.445304 0.465053 0.203632
C  -1.41193 2.036604 0.187787
C  -4.573436 0.630819 -0.639928
C  -2.96343 -0.848674 0.444593
C  -5.206483 -0.485606 -1.233705
C  -3.594167 -1.965547 -0.147125
C  -4.717899 -1.788981 -0.988395
C  2.941255 -0.188721 0.265561
C  0.826007 1.109065 0.069287
C  3.732346 0.590728 -0.608057
C  3.462086 -1.320745 0.929719
C  5.079897 0.206364 -0.805414
C  4.807583 -1.68497 0.717526
C  5.623165 -0.921924 -0.151987
H  -2.596992 1.524832 1.907997
H  -3.413166 2.566092 0.720184
H  -1.038248 3.013456 0.545615
H  -1.456347 2.049491 -0.915469
H  -4.962308 1.639362 -0.830593
H  -2.088003 -0.9883 1.087601
H  -6.078584 -0.338559 -1.881028
H  -3.209685 -2.973197 0.047832
H  -5.207421 -2.65651 -1.445209
H  3.314653 1.462088 -1.11357
H  2.808962 -1.891898 1.595777
H  5.704436 0.802051 -1.480228
H  5.215887 -2.562209 1.23055
H  6.668133 -1.204739 -0.317068
