program: Gaussian 09
title: 000298736
version: EM64L-G09RevD.01
frameworkgroup: C1[X(C16H16O5)]
method: RPBEPBE
basis: SDD
operation: Freq
keyword: #pfreq=noraman
keyword: PBEPBE/SDD
title: #p freq=noraman PBEPBE/SDD
converged: YES YES NO NO
title: Mulliken charges:
elementType: O O O O O C C C C C C C C C C C C C C C C H H H H H H H H H H H H H H H H
charge: -0.228749 -0.289558 -0.284294 -0.268503 -0.269922 0.488686 -0.498324 -0.503489 0.251295 -0.380690 0.193603 -0.331567 0.354543 0.297900 -0.535931 -0.518110 -0.389828 -0.325406 -0.195250 -0.205433 -0.247617 0.248132 0.226787 0.242627 0.259914 0.254678 0.226143 0.226455 0.244553 0.213408 0.259147 0.230238 0.261607 0.301807 0.231749 0.229193 0.230204
chargesum: 0.00000
title: Mulliken charges with hydrogens summed into heavy atoms:
elementType: O O O O O C C C C C C C C C C C C C C C C
charge: -0.228749 -0.289558 -0.284294 -0.268503 -0.269922 0.488686 -0.250192 -0.034075 0.251295 -0.120776 0.193603 -0.076889 0.354543 0.297900 0.161221 0.184683 -0.128221 -0.023599 0.036499 0.023761 -0.017413
polarizability: 2.49257892e+02 9.26106008e+00 1.70015767e+02 -7.95313379e+00 -1.98878475e+01 1.66652412e+02
1716.lowfreq: -11.7812 -2.8268 -0.0006 -0.0005 -0.0003 7.5368 12.8431 20.9960 24.0627
frequency: 12.5619 20.9365 23.5728 50.5217 61.8076 66.1130 97.6058 99.5309 108.6356 157.2544 173.5668 182.8151 214.3877 227.6698 245.3514 266.7684 283.4565 310.5405 330.2931 342.2814 370.0102 410.9290 430.4513 456.2171 481.0785 497.8138 537.8041 543.3191 588.0239 604.8991 645.2863 658.6684 681.0330 692.8403 706.8145 717.9869 748.1844 762.3694 774.9614 814.6627 838.0011 843.4492 863.5929 910.5528 921.5950 951.2273 955.7448 959.8122 976.7424 986.5867 989.2507 993.7955 1012.0824 1026.5092 1081.2285 1111.3482 1112.5772 1115.6975 1148.9642 1150.2996 1155.4733 1162.6022 1163.1504 1170.5091 1197.1101 1219.1954 1235.0406 1263.8209 1277.9651 1312.6084 1345.6378 1385.1898 1385.4360 1408.5659 1427.7893 1443.5165 1446.5005 1455.9450 1459.1277 1466.8712 1471.9583 1473.6363 1479.7215 1500.4594 1583.9618 1592.5285 1609.0148 1609.9496 1623.6494 2962.7856 2978.8098 3042.9062 3052.0962 3089.0513 3116.5143 3125.6519 3130.5264 3133.0058 3144.6448 3149.4287 3151.0791 3161.9887 3172.6905 3176.2237 3204.0239
redmass: 5.1268 4.7012 4.1252 4.1658 8.9309 3.4362 3.1825 2.6748 5.5208 2.3389 2.1457 3.3723 4.5612 2.5935 3.7445 2.8829 2.8519 3.9718 5.6841 4.4711 2.9082 2.9604 4.2499 5.3819 3.9542 3.1246 5.7759 4.5021 6.5385 6.5566 4.7510 7.8194 11.2441 2.3912 5.0799 5.0008 3.6255 1.4798 5.8835 3.7485 1.6296 1.2507 1.8376 4.2579 1.3910 1.3807 5.0690 7.6482 1.3578 5.9020 3.5223 1.3001 2.7083 2.0380 1.5067 1.2481 1.2588 2.1415 1.7892 2.3072 1.6197 1.7891 2.0016 1.0874 1.7269 1.8764 1.1624 2.4216 2.1708 1.3222 1.2817 6.0540 9.6558 2.1587 1.2229 2.2897 1.3656 1.0749 1.1253 1.0500 2.0925 1.1355 1.0559 2.6973 7.5916 6.3321 6.3289 6.5505 9.8943 1.0326 1.0347 1.0581 1.1042 1.0969 1.1087 1.0997 1.1050 1.0854 1.0906 1.0900 1.0891 1.0956 1.0969 1.0987 1.0946
irintensity: 0.4132 0.1061 0.1678 4.3888 0.6294 2.3208 3.5989 7.7220 1.4984 2.2488 1.5777 9.1431 4.8261 0.3275 0.0919 4.1588 5.9403 0.3329 1.3772 2.1096 18.8904 0.0218 23.1769 1.1606 3.6754 10.9274 13.5267 1.1260 8.7005 1.5832 7.5832 1.3937 13.0901 31.5865 25.8319 9.4556 4.7106 98.5300 74.0110 187.5829 3.2317 0.0991 6.2815 5.4625 11.6498 3.7138 94.6421 30.8239 0.0979 2.7171 80.2101 1.7758 19.4825 1.6848 15.4742 29.9719 0.4998 110.9487 252.0814 616.2185 114.4390 126.9871 496.6731 9.2978 159.3284 27.4012 6.5396 113.8132 124.2449 0.7952 34.4037 9.6411 16.1647 28.8512 1.6708 10.4604 16.1904 9.7326 26.4193 15.0272 130.8762 39.4923 28.6349 90.2728 23.3382 28.8634 22.4153 31.5941 159.1602 56.4241 80.6591 33.5078 43.5000 39.8564 5.3186 22.6659 16.5797 0.0812 18.0551 5.5567 6.2131 27.0707 3.6156 7.3802 5.5096
temp: 298.150 k
press: 1.00000 atm
elementType: 8 8 8 8 8 6 6 6 6 6 6 6 6 6 6 6 6 6 6 6 6 1 1 1 1 1 1 1 1 1 1 1 1 1 1 1 1
symmnumber: 1
zpe: 750456.0 jmol-1
zpe.correction: 0.285834 hartree
zpe.thermalcorrener: 0.305927 hartree
zpe.thermalcorrenthalpy: 0.306871 hartree
zpe.thermalcorrgfe: 0.233458 hartree
zpe.sumelectzpe: -993.849251 hartree
zpe.sumelectthermal: -993.829157 hartree
zpe.sumelectthermalent: -993.828213 hartree
zpe.sumelectthermalfe: -993.901626 hartree
dipole: -0.6462 -1.2840 2.4166
dipole: 2.8118
quadrupole: -111.0646 -113.3338 -114.5806
quadrupole: 12.6460 -7.7484 -0.6973
quadrupole: 1.9284 -0.3408 -1.5876 12.6460 -7.7484 -0.6973
hfenergy: -994.1350841 hartree
pointgroup: C01 [X(C16H16O5)]
dipole: -0.2715098 0.8212665 -0.6896176 debye
polarizability: 249.060263|-13.042939|183.4457573|-0.195902|-12.9535839|153.4200513 unknown
InChI: InChI=1S/C16H16O5/c1-18-14-9-8-12(10-15(14)19-2)11-20-16(17)21-13-6-4-3-5-7-13/h3-10H,11H2,1-2H3
charge 0 multiplicity 1
37 atoms
O  0.588255 1.531689 1.244927
O  -4.682214 1.027962 -0.609315
O  -4.768163 -1.806841 -0.242935
O  2.406916 0.984942 0.122638
O  1.604135 -0.518643 1.773121
C  -1.644113 0.439003 1.552186
C  -2.615036 1.117496 0.771423
C  -0.535337 1.2149 2.216258
C  -3.662415 0.413159 0.139258
C  -1.735946 -0.964255 1.704632
C  -3.738386 -1.011134 0.277485
C  -2.774219 -1.674401 1.067417
C  3.573237 0.266558 -0.298423
C  1.540537 0.543531 1.115511
C  -4.649716 2.488332 -0.726074
C  -5.156082 -1.635464 -1.659291
C  4.266454 0.923061 -1.339045
C  4.024792 -0.960923 0.236726
C  5.44008 0.340849 -1.859821
C  5.205632 -1.526099 -0.300877
C  5.915469 -0.887775 -1.341956
H  -2.541653 2.204935 0.666375
H  -0.850845 2.223039 2.526927
H  -0.100433 0.662984 3.066133
H  -0.983998 -1.496539 2.29556
H  -2.865001 -2.760511 1.164091
H  -3.730058 2.83189 -1.238049
H  -4.725536 2.970151 0.267826
H  -5.530847 2.746873 -1.331444
H  -4.282691 -1.801027 -2.319066
H  -5.577515 -0.633965 -1.837562
H  -5.910907 -2.416647 -1.836202
H  3.876203 1.871743 -1.718741
H  3.474763 -1.45592 1.037781
H  5.980603 0.846478 -2.667141
H  5.566782 -2.477554 0.104993
H  6.827251 -1.340376 -1.745825
