program: Gaussian 09
title: 000298725
version: EM64L-G09RevD.01
frameworkgroup: C1[X(C20H17BrSi)]
method: RPBEPBE
basis: SDD
operation: Freq
keyword: #p
keyword: freq=noraman
keyword: PBEPBE/SDD
title: #p freq=noraman PBEPBE/SDD
converged: YES YES NO NO
title: Mulliken charges:
elementType: Br Si C C C C C C C C C C C C C C C C C C C C H H H H H H H H H H H H H H H H H
charge: -0.013036 1.462019 -0.193880 -0.204357 -0.170352 -0.429439 -0.308182 -0.301810 -0.302679 -0.289623 -0.345471 -0.309315 -0.244210 -0.233866 -0.249720 -0.234527 -0.251871 -0.240179 -0.523982 -0.233284 -0.230340 -0.231763 0.249857 0.255035 0.253490 0.244672 0.259969 0.252611 0.229869 0.229843 0.230340 0.228855 0.231603 0.227171 0.243258 0.253437 0.229427 0.231131 0.229302
chargesum: 0.00000
title: Mulliken charges with hydrogens summed into heavy atoms:
elementType: Br Si C C C C C C C C C C C C C C C C C C C C
charge: -0.013036 1.462019 -0.193880 -0.204357 -0.170352 -0.429439 -0.058326 -0.046775 -0.049189 -0.044951 -0.085502 -0.056704 -0.014341 -0.004023 -0.019381 -0.005673 -0.020268 -0.013008 -0.027287 -0.003857 0.000790 -0.002461
polarizability: 2.73668114e+02 7.18841399e+00 2.52489488e+02 -2.31662000e+01 2.89312674e+00 2.16359945e+02
1716.lowfreq: -7.6994 -5.4248 -1.9847 -0.0017 -0.0016 -0.0012 21.0901 32.5050 34.7287
frequency: 20.7589 32.4478 34.6935 39.1163 45.2338 53.5714 67.4392 69.7808 84.6189 136.2048 173.2913 184.5653 201.8336 224.7159 235.3384 246.9912 271.8911 351.4006 377.9831 392.3103 393.9193 397.8491 424.7914 446.9876 459.2168 501.8406 515.2169 519.5860 614.7924 615.1539 616.1063 660.1255 670.8142 695.2196 699.9838 705.3548 707.9143 710.1859 712.3253 749.3865 751.6722 753.2814 861.3034 863.3224 868.9587 928.5708 931.3729 933.2677 939.5091 982.5959 983.5668 986.9833 987.5707 987.8678 989.2407 1000.0996 1000.5021 1001.7208 1022.3991 1023.5419 1023.7768 1060.4802 1074.8075 1076.2651 1079.0018 1095.0695 1100.3139 1103.1176 1173.7498 1173.9701 1174.3040 1198.7089 1198.8102 1201.7960 1310.1332 1313.0805 1315.9680 1363.9453 1364.9770 1366.6025 1387.6195 1417.9457 1419.2899 1420.9369 1470.2718 1471.2421 1472.0800 1575.6730 1576.7408 1577.9915 1594.8975 1596.2335 1597.4043 1597.6480 3085.1720 3111.6867 3116.3803 3118.6389 3119.2349 3121.3282 3124.9530 3130.9113 3132.0487 3135.7527 3143.5945 3143.6983 3145.5785 3160.1531 3160.4705 3160.9950 3191.3407
redmass: 5.6324 5.5679 4.1335 5.0040 5.1909 4.9484 4.4390 5.6304 4.5014 9.3886 4.6507 4.7738 5.1388 5.6923 4.8446 5.1364 3.6229 4.5212 6.3690 2.7708 2.8178 2.8316 6.2596 4.6119 4.2869 4.7489 7.3646 5.6936 6.4408 6.4430 6.4564 5.6290 1.1219 6.4259 4.5527 1.9130 1.9485 2.7219 2.1565 1.6447 1.7698 1.8103 1.2457 1.2448 1.2419 1.3515 1.3478 1.3387 1.3264 1.4182 1.4149 6.0216 2.1895 5.9807 2.2868 1.3142 1.3118 1.3068 3.2377 3.0031 3.0222 1.7059 1.7265 1.7167 1.7105 2.5815 2.7970 2.8066 1.0566 1.0563 1.0571 1.1295 1.1295 1.1309 1.4683 1.4475 1.4282 4.5460 4.6347 5.0832 1.1810 2.1323 2.1304 2.1380 2.0135 2.0137 2.0029 5.4689 5.4871 5.5546 5.0648 5.7484 5.7709 5.7376 1.0613 1.0871 1.0854 1.0876 1.0845 1.0861 1.0872 1.0914 1.0912 1.0921 1.0958 1.0958 1.0963 1.1015 1.1016 1.1016 1.1145
irintensity: 0.2164 0.1204 0.0672 0.0408 0.0910 0.0849 0.0826 0.1541 0.0633 0.2476 1.1192 0.8376 2.7528 0.8811 0.5293 1.2094 1.9151 3.4317 1.5873 0.1915 0.0727 0.0815 21.2529 5.1741 3.4092 92.6629 92.7026 72.2894 0.2827 0.3047 0.5071 2.0868 1.2955 11.0488 21.3210 66.4132 36.8662 40.9428 86.3705 8.7384 27.2444 24.0292 0.3629 0.0878 0.3529 2.5732 1.3068 14.7300 34.7346 0.2710 0.1791 2.3752 0.7617 1.8931 0.5401 0.1871 0.0332 0.0176 0.4132 3.5050 3.1714 40.5929 2.5536 3.2288 1.3919 10.1087 45.3063 46.1143 0.3053 0.4873 0.4138 7.0806 6.8165 2.0696 5.3962 5.1357 4.1454 1.4760 1.7591 1.6888 21.4352 16.1067 17.4802 18.6433 3.5979 9.6877 10.5982 0.3401 0.5974 0.3531 13.3322 0.6954 0.1358 0.8989 1.1333 7.2402 2.5613 2.1605 0.3574 0.3360 0.4043 6.5846 7.4338 8.8176 32.7520 35.9633 39.7307 44.4889 50.6286 13.8821 4.2918
temp: 298.150 k
press: 1.00000 atm
elementType: 35 14 6 6 6 6 6 6 6 6 6 6 6 6 6 6 6 6 6 6 6 6 1 1 1 1 1 1 1 1 1 1 1 1 1 1 1 1 1
symmnumber: 1
zpe: 790163.9 jmol-1
zpe.correction: 0.300958 hartree
zpe.thermalcorrener: 0.321689 hartree
zpe.thermalcorrenthalpy: 0.322633 hartree
zpe.thermalcorrgfe: 0.247742 hartree
zpe.sumelectzpe: -1073.650561 hartree
zpe.sumelectthermal: -1073.629829 hartree
zpe.sumelectthermalent: -1073.628885 hartree
zpe.sumelectthermalfe: -1073.703776 hartree
dipole: -2.1219 0.4134 -0.9242
dipole: 2.3511
quadrupole: -136.6107 -133.4335 -138.5353
quadrupole: 2.6955 -7.8182 0.4371
quadrupole: -0.4176 2.7596 -2.3421 2.6955 -7.8182 0.4371
hfenergy: -1073.9515182 hartree
pointgroup: C01 [X(C20H17Br1Si1)]
dipole: 0.3352303 0.5649143 0.6512094 debye
polarizability: 269.8402424|15.3216834|265.0862138|0.6399344|0.8340838|207.5910905 unknown
InChI: InChI=1S/C20H17BrSi/c1-17(21)22(18-11-5-2-6-12-18,19-13-7-3-8-14-19)20-15-9-4-10-16-20/h2-16H,1H2
charge 0 multiplicity 1
39 atoms
Br -1.329205 -1.322199 -3.305853
Si -0.109808 0.022254 -0.542999
C  -1.830615 0.275808 0.243576
C  1.081064 1.423496 -0.012395
C  0.58887 -1.681462 -0.028755
C  -0.310427 0.164809 -2.44868
C  -2.126814 -0.272028 1.522409
C  0.698668 2.353741 0.992552
C  -0.232468 -2.843202 -0.084027
C  -2.826838 1.058588 -0.401328
C  2.376267 1.554557 -0.590436
C  1.924822 -1.82675 0.435557
C  -3.378754 -0.04434 2.138458
C  1.579761 3.37845 1.409759
C  0.268406 -4.10711 0.299351
C  -4.080739 1.28648 0.210172
C  3.259033 2.577914 -0.176972
C  2.42869 -3.090403 0.821674
C  0.120684 1.169771 -3.247402
C  -4.358975 0.736316 1.483087
C  2.862444 3.492656 0.826624
C  1.602562 -4.235045 0.751163
H  -1.379952 -0.88875 2.037896
H  -0.294999 2.279933 1.45056
H  -1.270753 -2.763052 -0.426674
H  -2.627554 1.484837 -1.392427
H  2.698711 0.858323 -1.375357
H  2.576033 -0.948474 0.514199
H  -3.588583 -0.476716 3.123471
H  1.264212 4.085228 2.185711
H  -0.381161 -4.98819 0.245984
H  -4.837996 1.887437 -0.306158
H  4.251065 2.660463 -0.635622
H  3.461109 -3.178547 1.17903
H  -0.055484 1.196628 -4.328697
H  0.674448 2.007675 -2.80487
H  -5.331622 0.910925 1.957437
H  3.545631 4.286949 1.148594
H  1.991771 -5.21527 1.049786
