program: Gaussian 09
title: 000298684
version: EM64L-G09RevD.01
frameworkgroup: C1[X(C7H10O5)]
method: RPBEPBE
basis: SDD
operation: Freq
keyword: #pfreq=noraman
keyword: PBEPBE/SDD
title: #p freq=noraman PBEPBE/SDD
converged: NO YES NO NO
title: Mulliken charges:
elementType: O O O O O C C C C C C C H H H H H H H H H H
charge: -0.162650 -0.181541 -0.112758 -0.190978 -0.331098 0.100905 0.212080 -0.488579 -0.445423 -0.437221 -0.724678 0.200060 0.232273 0.255410 0.264831 0.232583 0.243839 0.236326 0.249703 0.227421 0.242986 0.376510
chargesum: 0.00000
title: Mulliken charges with hydrogens summed into heavy atoms:
elementType: O O O O O C C C C C C C
charge: -0.162650 -0.181541 -0.112758 -0.190978 0.045412 0.100905 0.212080 -0.000896 0.051991 0.042943 -0.004568 0.200060
polarizability: 1.09647549e+02 1.85697645e+00 8.50413791e+01 -4.87774215e+00 2.18389257e+00 7.86579042e+01
1716.lowfreq: -11.9324 -2.2190 -0.0005 -0.0004 0.0007 17.7299 53.2965 101.2422 152.5666
frequency: 53.1938 101.2407 152.5599 169.0103 202.1432 215.2606 235.1977 264.9916 284.6812 288.1947 336.1509 350.5899 409.8189 481.2793 541.0665 555.6641 595.9599 619.6533 671.4931 689.2135 742.4346 785.2906 824.4374 834.5243 848.3538 881.2161 901.5927 935.6213 1002.3095 1013.1369 1033.2092 1054.9155 1102.7758 1110.8784 1154.5652 1190.2519 1195.5463 1220.1342 1254.1768 1278.8529 1294.1675 1309.0628 1320.8910 1393.7439 1454.3804 1462.4414 1468.5174 1474.4000 1480.4183 1690.4824 3002.2123 3010.0793 3022.1196 3024.4544 3075.1572 3090.3165 3104.1901 3107.1873 3111.6637 3443.3056
redmass: 4.6730 5.7695 4.9395 4.2175 3.3941 3.0857 1.1799 1.4033 2.4378 2.2027 2.8113 7.6928 5.1569 5.3333 3.8823 3.6056 5.2154 4.8070 9.1767 6.9056 3.6573 5.2292 4.0941 7.2745 1.9767 1.7526 2.3610 2.3279 3.4135 2.7536 1.7460 1.8041 3.7368 1.8646 3.1060 1.5447 2.5031 2.1374 1.7529 1.1180 1.4436 1.5233 1.3118 1.1786 1.0859 1.0536 1.0762 1.0727 1.0711 12.3397 1.0350 1.0617 1.0616 1.0656 1.1016 1.1032 1.1010 1.1017 1.1009 1.0681
irintensity: 2.9191 15.6371 0.8308 0.1460 2.3665 0.8953 1.7895 77.8813 9.8244 48.8546 5.1586 11.4963 4.8314 8.9968 1.9206 4.7742 3.1644 5.5222 2.4771 1.0630 23.3781 7.0047 18.5853 6.7749 7.1156 16.7707 1.2428 17.1649 62.3452 35.8915 8.1109 39.0146 4.8839 8.1598 5.1509 1.5304 13.3402 19.4610 3.1699 57.4622 14.1447 1.4367 1.6460 17.3667 17.7316 8.2825 12.5249 15.3335 9.3203 227.1123 8.8841 22.5099 24.8818 7.7275 9.8296 19.5244 10.3598 10.4041 16.9233 22.3605
temp: 298.150 k
press: 1.00000 atm
elementType: 8 8 8 8 8 6 6 6 6 6 6 6 1 1 1 1 1 1 1 1 1 1
symmnumber: 1
zpe: 436163.1 jmol-1
zpe.correction: 0.166126 hartree
zpe.thermalcorrener: 0.177815 hartree
zpe.thermalcorrenthalpy: 0.178759 hartree
zpe.thermalcorrgfe: 0.129152 hartree
zpe.sumelectzpe: -647.779789 hartree
zpe.sumelectthermal: -647.768100 hartree
zpe.sumelectthermalent: -647.767156 hartree
zpe.sumelectthermalfe: -647.816763 hartree
dipole: 1.6209 3.1477 0.9461
dipole: 3.6647
quadrupole: -79.4999 -65.2098 -71.7340
quadrupole: -6.2042 -5.8574 -0.6535
quadrupole: -7.3520 6.9381 0.4139 -6.2042 -5.8574 -0.6535
hfenergy: -647.9459147 hartree
pointgroup: C01[X(C7H10O5)]
dipole: -0.7276527 -1.2105342 0.2897675 debye
dipolederiv: -0.2753919 0.1390654 -0.0627162 -0.0866072 -0.2073518 0.0767666 0.2723199 -0.0568906 -0.3569778 -0.1814689 -0.0664176 0.1098784 -0.0400142 -0.3465701 -0.1301567 0.3165854 -0.039515 -0.2898872 -0.369318 -0.1180641 -0.0010176 0.3159142 -0.2704676 0.2393413 -0.3612469 0.108378 -0.3546129 -1.0710428 -0.1498682 -0.061706 -0.1058279 -0.3728132 0.074429 -0.099653 0.0636298 -0.389762 -0.3463799 0.2148327 0.022517 0.3098712 -0.1966791 -0.1646217 -0.1209738 -0.1469368 -0.2758632 -0.1337721 -0.1555568 0.0396578 -0.1074176 -0.1706449 0.0793707 0.1215191 0.0693228 -0.0715105 0.4741334 0.0173496 -0.1434077 -0.0284804 0.5290599 0.1085805 -0.6553125 0.1620269 0.5930477 0.0052495 0.0212738 -0.0341282 -0.0091097 0.1809317 -0.0568922 -0.0003704 -0.0054185 0.0535791 -0.0187096 -0.0533044 0.0029665 0.0048334 -0.0373511 -0.0451951 0.0832128 -0.0550247 0.0139861 0.0325053 -0.0045605 -0.0201191 0.0168492 0.0410479 -0.0757673 -0.0077528 0.0179358 0.0950323 0.0520711 -0.018478 -0.0112686 -0.0043473 0.0298286 0.0146469 -0.0062321 -0.042132 0.0437648 1.402697 0.2719539 0.052998 -0.0661427 0.5108882 -0.3993246 0.3598194 -0.3106597 0.5881528 0.0661371 -0.0366037 0.0139316 -0.0055978 -0.0224157 0.073549 -0.0239925 0.0864089 -0.0845425 -0.0874895 0.0543362 0.0434075 0.0095738 0.0651997 -0.0141155 0.0556733 -0.0302828 0.0533863 0.003454 0.0250232 -0.0738261 0.0737951 0.0857965 0.0173233 -0.0914551 0.0063162 0.0311232 0.0657711 0.0000311 0.0540215 -0.0604379 0.0171026 0.0400307 0.086553 0.0361242 -0.0477274 0.0223641 -0.0014396 0.0398082 -0.0001896 0.0842504 0.0822277 0.0326785 0.0168543 -0.0985063 0.0626004 -0.0517069 -0.0181761 -0.0511732 -0.1566745 -0.0453666 -0.0054608 -0.0149095 0.0866161 0.1129772 0.023167 0.0145396 0.0190194 -0.077555 -0.0710803 0.0013187 -0.0381873 0.0585023 0.029341 -0.0875655 0.067936 -0.0834358 0.0146845 0.0675666 0.0359183 0.043302 0.0187948 -0.0681047 0.0630896 -0.0590229 0.0597536 0.0893273 0.0142403 0.0017662 -0.0003232 0.0688559 0.2223761 -0.0865572 0.0237267 -0.1608286 0.2104056 0.1144474 0.0050851 0.1299813 0.2645485 unknown
polarizability: 109.9894464|-0.5573495|85.2848513|3.9106183|-1.9994144|78.0725348 unknown
InChI: InChI=1S/C7H10O5/c1-6-3-2-4-7(6,11-9)12-10-5(6)8/h9H,2-4H2,1H3
charge 0 multiplicity 1
22 atoms
O  -0.598705 0.774061 -1.261522
O  -1.407248 0.881243 1.017256
O  0.828831 1.362094 -1.218014
O  2.786225 0.778764 -0.150738
O  -2.820754 1.188179 0.530201
C  0.643108 -0.352679 0.508928
C  -0.790305 0.024562 0.027309
C  0.807762 -1.85262 0.058269
C  -1.531415 -1.262011 -0.36409
C  -0.380988 -2.152318 -0.896491
C  0.915837 -0.169114 2.020242
C  1.566335 0.594201 -0.272744
H  0.742453 -2.485592 0.962188
H  1.792941 -2.035182 -0.403685
H  -2.330171 -1.073886 -1.098137
H  -1.994172 -1.683144 0.54761
H  -0.133175 -1.85665 -1.931467
H  -0.647202 -3.222582 -0.904291
H  0.766432 0.873977 2.343793
H  0.242241 -0.812388 2.610676
H  1.961422 -0.455184 2.22887
H  -2.650254 2.030168 0.012735
