program: Gaussian 09
title: 000298679
version: EM64L-G09RevD.01
frameworkgroup: C1[X(C10H12N2O)]
method: RPBEPBE
basis: SDD
operation: Freq
keyword: #p
keyword: freq=noraman
keyword: PBEPBE/SDD
title: #p freq=noraman PBEPBE/SDD
converged: YES YES NO NO
title: Mulliken charges:
elementType: O N N C C C C C C C C C C H H H H H H H H H H H H
charge: -0.211397 -0.279157 -0.068890 0.368593 0.368931 0.150662 -0.415077 -0.408359 -0.775642 -0.790920 -0.465280 0.360224 -0.769995 0.248238 0.247247 0.229613 0.262432 0.225918 0.216212 0.243051 0.240523 0.271233 0.254647 0.254823 0.242372
chargesum: 0.00000
title: Mulliken charges with hydrogens summed into heavy atoms:
elementType: O N N C C C C C C C C C C
charge: -0.211397 -0.279157 -0.068890 0.368593 0.368931 0.150662 -0.166839 -0.161112 -0.057679 -0.091135 -0.194047 0.360224 -0.018153
polarizability: 1.74969275e+02 -9.90743737e-02 1.25575002e+02 7.91785008e-01 -3.73913300e+00 7.15454247e+01
1716.lowfreq: -8.3255 -4.1081 -0.0004 -0.0003 0.0004 8.7595 41.5612 76.3588 87.0200
frequency: 41.5206 76.3553 87.0116 109.5888 151.5563 160.6272 187.3597 221.4428 257.8249 282.4371 285.8925 343.3323 385.3935 405.6152 497.3032 585.1616 585.5831 613.9247 628.8493 661.0182 678.1164 728.1589 783.5197 824.2397 837.4631 845.4678 913.8744 925.5869 962.1679 976.1994 1002.1037 1022.5232 1031.3289 1039.9371 1048.9121 1050.1385 1069.0718 1167.9660 1219.0077 1234.5290 1276.3711 1305.2439 1362.1188 1385.3643 1405.1296 1405.6763 1410.7982 1455.3862 1458.2174 1466.0545 1466.5868 1471.4961 1476.8453 1498.6472 1553.3738 1593.1842 1609.3702 2961.5290 2981.8355 2994.4199 3036.8465 3061.3440 3075.2682 3089.5594 3094.3545 3112.7215 3203.0306 3223.5825 3258.3173
redmass: 4.3770 2.4424 1.2641 3.0962 1.2619 2.0419 1.0923 3.5336 3.2147 3.2494 3.0412 4.1628 4.2516 4.8321 3.3942 4.6547 5.0434 3.0812 5.2197 4.5061 4.4508 4.6482 1.2042 1.3597 8.5316 1.3548 6.6109 4.3844 2.7131 1.6526 1.8573 1.7426 1.4069 1.4363 1.4950 1.4593 2.0495 3.4262 1.4433 2.6695 4.1978 7.1502 3.1446 7.6671 1.2467 1.2448 1.2499 1.0426 1.0443 1.0605 1.1442 1.1113 1.1280 6.0227 5.7881 5.7287 6.7496 1.0416 1.0383 1.0373 1.0944 1.0958 1.0981 1.0965 1.0991 1.0988 1.0929 1.1037 1.0995
irintensity: 5.6179 0.3894 1.4714 0.2574 1.8572 5.6264 0.8358 1.1993 0.6745 0.4579 2.1232 0.4171 3.1343 5.5279 2.1530 2.1455 2.3654 2.2391 5.7878 0.7315 1.0954 0.9797 67.5842 35.7752 21.8452 0.0326 4.3674 3.0452 0.6722 4.5414 8.3661 2.8102 9.5837 1.8021 7.0284 8.8785 1.1149 5.0032 4.0229 12.0054 48.1689 4.2667 20.9045 26.2341 20.4209 11.4060 5.5608 16.5777 15.9090 18.6902 9.7541 13.0107 47.2695 331.1132 17.2836 20.2158 109.3749 54.1310 29.0683 15.7696 22.3913 17.0356 8.7311 19.9993 22.7329 9.2633 9.3387 4.3850 0.6314
temp: 298.150 k
press: 1.00000 atm
elementType: 8 7 7 6 6 6 6 6 6 6 6 6 6 1 1 1 1 1 1 1 1 1 1 1 1
symmnumber: 1
zpe: 524088.7 jmol-1
zpe.correction: 0.199615 hartree
zpe.thermalcorrener: 0.212353 hartree
zpe.thermalcorrenthalpy: 0.213297 hartree
zpe.thermalcorrgfe: 0.160273 hartree
zpe.sumelectzpe: -571.986822 hartree
zpe.sumelectthermal: -571.974084 hartree
zpe.sumelectthermalent: -571.973139 hartree
zpe.sumelectthermalfe: -572.026164 hartree
dipole: 2.1174 2.7339 -1.8398
dipole: 3.9170
quadrupole: -66.3678 -73.1385 -80.9707
quadrupole: 5.7861 -3.6976 2.4540
quadrupole: 7.1246 0.3538 -7.4784 5.7861 -3.6976 2.4540
hfenergy: -572.1864368 hartree
pointgroup: C01 [X(C10H12N2O1)]
dipole: 0.8117047 1.1006475 -0.7103265 debye
dipolederiv: -0.7718104 0.0957107 -0.0635667 0.0356638 -0.3157802 0.1144636 0.0572337 0.1104698 -0.206708 -1.4393916 0.1097751 -0.0804331 0.0738075 -0.2286761 -0.0029088 0.0292804 -0.0154692 -0.052668 0.0349837 -0.0639195 0.0471585 0.1256051 -0.203446 0.0283919 -0.1099952 0.0217404 -0.1870271 0.6510135 -0.0116504 0.0396681 0.3738302 0.1574337 0.0696796 -0.0255601 0.0547788 -0.0625927 0.5463569 -0.1359855 0.0207726 -0.4737983 0.1605918 0.0341287 0.0700558 -0.0111022 -0.0677144 1.5843758 -0.0371054 0.013532 0.0573489 0.16093 -0.0995085 -0.0563612 -0.0658678 0.1683829 -0.3074532 0.1274168 0.0146435 0.2140159 -0.0962474 0.0296975 0.0396714 0.0209265 -0.2499899 -0.3419979 -0.0277826 -0.0116395 -0.1537531 0.0275056 0.0050996 -0.0514621 0.0273074 -0.2566022 0.0294042 0.0600698 0.0023006 -0.0214267 -0.0635938 -0.0112617 -0.0057518 -0.0011505 0.0888231 0.0323726 -0.0042221 -0.0230126 0.0493854 -0.0005924 -0.0411229 -0.012501 -0.0217653 0.1224258 -0.7537873 -0.0045126 0.0019418 -0.1071348 -0.1156239 -0.0495341 0.001041 -0.0394636 -0.1779848 0.7212505 -0.0222832 0.0064988 -0.116096 0.2981077 -0.1687569 0.0449174 -0.1558915 0.1401052 -0.1820432 -0.0710151 0.0488742 0.0023013 0.0288198 0.0225068 0.0119088 0.0170373 0.058785 -0.019881 -0.0831271 -0.0243456 -0.0979817 0.0277614 -0.0280968 -0.0084871 -0.0292514 0.1924938 0.0130532 0.0888787 0.0013685 0.1036782 -0.0056751 -0.0201651 -0.01381 -0.018193 0.1905564 0.0104559 0.0695787 0.1280513 0.0259655 0.0189082 0.0068065 0.1241053 -0.0448131 -0.0314699 0.0876983 0.0905111 -0.0638437 0.0581275 0.0114657 0.0168279 -0.0681441 0.0736261 -0.0239131 -0.0851925 -0.1573621 -0.0484028 -0.0651442 0.0108471 -0.0279371 -0.0439855 -0.0514207 0.1061843 0.0160504 -0.1422019 0.0871324 -0.086407 -0.0309714 0.0234 0.1163112 0.101185 -0.0704001 -0.0398195 0.1475998 0.0547731 0.0622495 -0.0121487 -0.0377107 0.0371889 -0.0516554 0.1020262 -0.0163304 -0.07062 -0.1206487 -0.0225846 0.0409925 0.0340859 -0.132547 -0.0161909 -0.0149988 0.1508458 0.0172006 -0.0148895 -0.0121932 0.0462835 0.0905314 -0.0200602 0.0852901 0.1377568 0.0050539 -0.03117 -0.0463244 -0.0512572 0.1153916 -0.0067746 -0.0994651 -0.0273433 -0.0404923 0.009667 0.0291952 0.0461758 0.0693834 -0.0003421 -0.0834636 0.0882914 -0.061759 0.0736469 0.0651252 0.0270208 -0.0157846 -0.0435856 -0.0319414 0.1016215 0.0281249 0.0989755 0.0613749 unknown
polarizability: 174.9365207|1.0414292|125.6567831|1.3995621|-3.2462921|71.496398 unknown
InChI: InChI=1S/C10H12N2O/c1-7-4-5-8(2)12(7)10-6-9(3)13-11-10/h4-6H,1-3H3
charge 0 multiplicity 1
25 atoms
O  2.52812 -0.961132 0.620518
N  -0.864993 0.021814 0.011405
N  1.08375 -1.157572 0.775963
C  -1.779289 -1.059903 -0.153379
C  -1.591394 1.246202 0.104726
C  0.535397 -0.1017 0.110357
C  -3.057512 -0.506096 -0.175516
C  -2.941781 0.922869 -0.007517
C  -1.354296 -2.492291 -0.31095
C  -0.951226 2.587184 0.333694
C  1.537317 0.776896 -0.446473
C  2.754762 0.215526 -0.110498
C  4.181043 0.579024 -0.366477
H  -3.977347 -1.075083 -0.303003
H  -3.758358 1.642701 0.035704
H  -0.617087 -2.623679 -1.125731
H  -0.889976 -2.895632 0.605648
H  -2.242508 -3.09993 -0.553399
H  -0.474033 3.003207 -0.575843
H  -1.730488 3.302668 0.645261
H  -0.183071 2.5596 1.129079
H  1.370458 1.672484 -1.036376
H  4.726424 0.737487 0.581287
H  4.702021 -0.223608 -0.91861
H  4.237567 1.505265 -0.959969
