program: Gaussian 09
title: 000298699
version: EM64L-G09RevD.01
frameworkgroup: C1[X(C22H28N2O2)]
method: RPBEPBE
basis: SDD
operation: Freq
keyword: #p
keyword: freq=noraman
keyword: PBEPBE/SDD
title: #p freq=noraman PBEPBE/SDD
converged: YES YES NO NO
title: Mulliken charges:
elementType: O O N N C C C C C C C C C C C C C C C C C C C C C C H H H H H H H H H H H H H H H H H H H H H H H H H H H H
charge: -0.258636 -0.258642 -0.091301 -0.091301 -0.382160 -0.382159 -0.342242 -0.342242 -0.294707 -0.294702 -0.686050 -0.686050 0.353630 0.353629 -0.381889 -0.381889 -0.337990 -0.337990 0.426736 0.426739 -0.353641 -0.353642 -0.378732 -0.378727 -0.378546 -0.378546 0.211585 0.211626 0.211610 0.211602 0.194165 0.194177 0.194153 0.194188 0.205923 0.205876 0.205944 0.205853 0.212753 0.218463 0.212791 0.212787 0.218463 0.212758 0.251923 0.251924 0.248664 0.248662 0.230330 0.230330 0.269432 0.269432 0.237819 0.237817
chargesum: 0.00000
title: Mulliken charges with hydrogens summed into heavy atoms:
elementType: O O N N C C C C C C C C C C C C C C C C C C C C C C
charge: -0.258636 -0.258642 -0.091301 -0.091301 0.041051 0.041054 0.046100 0.046100 0.117092 0.117094 -0.042043 -0.042043 0.353630 0.353629 -0.129967 -0.129966 -0.089325 -0.089328 0.426736 0.426739 -0.123312 -0.123312 -0.109300 -0.109295 -0.140727 -0.140729
polarizability: 7.13199116e+02 -3.92771923e+01 2.47445752e+02 8.69224166e-02 1.15696898e-01 1.38273373e+02
1716.lowfreq: -4.5509 -2.8904 -0.0023 0.0019 0.0026 6.9402 11.4636 15.4619 25.5124
frequency: 11.4636 15.4616 25.1760 27.0807 41.6805 43.3210 57.4548 60.8007 70.8198 71.6831 97.8171 98.4074 114.9744 138.4158 144.5063 146.5316 168.4282 186.0026 186.3553 214.0011 215.5501 216.1291 226.2829 252.4010 262.2580 291.1129 317.2329 379.8735 382.4598 392.6896 409.5788 418.3401 425.6366 430.6506 485.3802 511.0404 515.6299 522.3636 538.1591 589.2086 624.8126 633.0301 637.2812 733.5009 737.5421 743.6949 743.7035 779.2140 781.1177 809.8718 809.9290 826.2512 826.6255 838.2249 840.5347 850.7511 868.6692 903.3155 903.4108 941.0981 941.1567 948.6423 953.5734 964.0705 964.2849 970.8019 975.4362 977.2168 982.2871 986.9597 999.2096 999.5810 1041.3813 1041.5358 1082.9150 1082.9632 1113.5668 1114.5877 1124.6890 1124.8558 1144.5738 1144.5772 1168.3878 1172.2960 1213.6789 1213.6820 1221.0563 1223.8126 1236.9202 1241.8614 1276.8461 1276.8674 1281.9644 1281.9675 1289.0337 1289.0408 1298.4257 1305.4951 1309.0434 1348.9866 1349.0124 1356.8636 1369.8281 1370.1258 1381.6400 1381.6671 1391.7344 1391.7481 1426.6922 1428.9476 1469.3872 1469.5386 1472.3427 1472.4495 1475.2304 1475.2317 1479.7715 1480.2372 1489.0397 1489.4026 1497.9378 1498.1066 1510.3519 1563.9731 1573.7396 1599.0083 1618.1227 1620.3091 2949.0496 2949.1466 2968.7202 2968.7229 2976.8150 2976.8359 2997.0085 2997.0127 3007.3917 3007.4029 3013.1051 3013.1102 3020.2795 3023.9859 3061.3861 3061.3931 3076.1418 3076.1565 3077.0345 3077.0430 3126.1173 3126.1377 3147.5519 3147.5905 3166.3288 3166.3375 3169.3939 3169.5503
redmass: 4.6507 4.7861 3.2972 2.7107 4.5485 4.5372 1.6892 1.7988 4.3956 4.3879 4.5124 3.5563 3.3349 5.0930 1.9164 2.0338 5.6413 3.2741 4.0110 3.7607 1.1942 1.1658 3.8387 4.8099 6.7563 5.1498 4.7887 3.7928 3.2946 3.1247 3.8050 3.0147 4.2120 6.3490 4.2066 5.5191 4.1222 2.3557 2.4900 6.2420 7.2907 6.9604 7.3441 3.5852 3.7040 1.0760 1.0760 5.8547 5.8507 1.1702 1.1695 1.2368 1.2300 1.5506 1.5972 4.8330 4.4625 1.7985 1.7985 1.1588 1.1578 1.3534 1.3513 6.9468 6.9793 7.8014 1.3828 1.3545 1.4915 1.5335 2.6493 2.5996 3.4314 3.4291 2.2047 2.2030 1.3834 1.3855 2.4493 2.4283 1.4454 1.4454 1.2494 1.2083 1.3673 1.3672 2.2564 2.2950 2.5761 2.2341 1.3025 1.3033 1.1743 1.1742 1.0660 1.0660 1.7401 1.3408 1.3394 1.4606 1.4552 2.7912 2.5631 3.1627 1.6569 1.6519 1.2373 1.2397 4.6264 4.3297 1.0913 1.0866 1.0759 1.0732 1.0420 1.0420 1.1302 1.1198 1.1807 1.1779 2.6731 1.9406 3.7770 7.5289 6.9419 6.6141 6.3063 6.4283 1.0552 1.0552 1.0589 1.0589 1.0364 1.0364 1.0593 1.0593 1.1055 1.1055 1.1018 1.1018 1.0872 1.0885 1.1042 1.1042 1.1018 1.1018 1.0994 1.0994 1.0895 1.0895 1.0875 1.0875 1.0952 1.0952 1.0961 1.0962
irintensity: 0.4317 0.6195 0.0000 0.1067 0.1165 0.0000 0.0000 0.3746 0.0000 0.0395 0.0001 0.0170 0.0001 9.8967 0.0001 10.7953 0.0002 0.0025 0.8143 0.0000 0.8401 0.0002 1.7360 0.8263 0.0000 6.4238 0.0000 10.5413 0.0002 0.7909 0.0000 1.9311 0.0011 8.3056 0.0002 0.0001 39.5995 54.9858 0.0004 0.0000 31.4792 0.0000 41.6517 1.7786 0.0002 1.5001 20.5436 0.0000 16.0393 3.2261 0.0022 5.6664 0.0003 123.6211 0.0001 9.6458 0.0002 54.7562 0.0132 1.5579 0.0050 18.7275 0.0000 244.3261 0.0043 0.0014 5.2691 0.0000 33.7227 0.0001 9.2012 0.0000 69.7664 0.0002 25.5123 0.1360 22.2380 0.0000 33.6630 0.0007 1.5893 1.8216 571.6634 0.0000 0.0006 0.0038 433.3975 0.0001 516.7275 0.0000 14.2301 0.8793 0.0882 0.6385 0.0622 0.1023 20.2113 0.0000 6.8723 0.0050 0.1706 0.0000 0.0001 41.5071 193.3857 0.6188 4.4952 0.0067 0.0000 1.4919 32.5689 0.0009 13.5221 0.0009 0.8992 25.4833 154.8751 0.0006 138.1328 0.0019 0.0130 199.9911 0.0000 2.3569 0.0000 300.8793 544.0376 0.0000 66.3463 0.0604 23.2853 44.2586 85.0061 0.0498 19.2610 56.2538 4.6754 47.8159 3.0394 3.2783 54.6320 0.0005 4.0554 21.6771 9.3325 204.9452 66.0875 33.9251 0.2843 24.4144 18.1160 0.0128 3.3663 22.0512 36.8774 0.0112
temp: 298.150 k
press: 1.00000 atm
elementType: 8 8 7 7 6 6 6 6 6 6 6 6 6 6 6 6 6 6 6 6 6 6 6 6 6 6 1 1 1 1 1 1 1 1 1 1 1 1 1 1 1 1 1 1 1 1 1 1 1 1 1 1 1 1
symmnumber: 1
zpe: 1181206.8 jmol-1
zpe.correction: 0.449898 hartree
zpe.thermalcorrener: 0.477302 hartree
zpe.thermalcorrenthalpy: 0.478247 hartree
zpe.thermalcorrgfe: 0.386971 hartree
zpe.sumelectzpe: -1113.107374 hartree
zpe.sumelectthermal: -1113.079969 hartree
zpe.sumelectthermalent: -1113.079025 hartree
zpe.sumelectthermalfe: -1113.170301 hartree
dipole: 0.0001 -0.0001 0.0059
dipole: 0.0059
quadrupole: -94.1507 -144.7547 -161.4858
quadrupole: 20.2341 0.0038 0.0358
quadrupole: 39.3130 -11.2910 -28.0221 20.2341 0.0038 0.0358
hfenergy: -1113.5572715 hartree
pointgroup: C01 [X(C22H28N2O2)]
dipole: -0.0000491 -0.0000543 -0.0023316 debye
polarizability: 714.0359205|33.942687|246.5975315|-0.3894948|-1.1192656|138.2847885 unknown
InChI: InChI=1S/C22H28N2O2/c1-3-5-15-25-21-11-7-19(8-12-21)17-23-24-18-20-9-13-22(14-10-20)26-16-6-4-2/h7-14,17-18H,3-6,15-16H2,1-2H3
charge 0 multiplicity 1
54 atoms
O  7.152398 0.838258 -0.325241
O  -7.153297 -0.843468 -0.309651
N  0.696113 -0.16552 -0.316396
N  -0.697018 0.16038 -0.320361
C  9.399877 -0.06238 -0.321345
C  -9.400825 0.057014 -0.317282
C  10.302761 -1.3185 -0.310102
C  -10.303773 1.313113 -0.326132
C  7.91456 -0.427794 -0.314569
C  -7.915525 0.422524 -0.322372
C  11.804838 -0.962336 -0.317784
C  -11.805836 0.95685 -0.321006
C  5.755614 0.766962 -0.325192
C  -5.756511 -0.772155 -0.311409
C  5.081027 2.015129 -0.338959
C  -5.081908 -2.020324 -0.298706
C  5.01083 -0.445097 -0.312235
C  -5.011744 0.439915 -0.324391
C  2.911799 0.845942 -0.327268
C  -2.912696 -0.851118 -0.311312
C  3.67818 2.048645 -0.339953
C  -3.67906 -2.053833 -0.298706
C  3.605753 -0.397056 -0.313393
C  -3.606667 0.39188 -0.324265
C  1.451488 0.919766 -0.328883
C  -1.452389 -0.924936 -0.310335
H  9.616559 0.549983 -1.217465
H  9.620149 0.568336 0.561055
H  -9.620744 -0.571901 -1.201047
H  -9.617805 -0.557194 0.577508
H  10.068702 -1.950497 -1.19104
H  10.073212 -1.931232 0.58552
H  -10.073392 1.928341 -1.219834
H  -10.070595 1.942668 0.556778
H  7.647752 -1.026856 -1.21019
H  7.651758 -1.00928 0.59376
H  -7.651386 1.003419 -1.230655
H  -7.650129 1.022209 0.573287
H  12.072541 -0.354881 0.566889
H  12.433962 -1.870865 -0.307499
H  12.068924 -0.377602 -1.218689
H  -12.070527 0.368436 0.577325
H  -12.434997 1.865386 -0.328031
H  -12.072892 0.352998 -1.208333
H  5.676986 2.93256 -0.34873
H  -5.677854 -2.937762 -0.288907
H  5.516185 -1.415174 -0.301248
H  -5.517111 1.409994 -0.334567
H  3.160897 3.015869 -0.350813
H  -3.161765 -3.021059 -0.288674
H  3.016126 -1.319507 -0.303542
H  -3.017054 1.31434 -0.334107
H  0.982277 1.92047 -0.340772
H  -0.98317 -1.925661 -0.300531
