program: Gaussian 09
title: 000298713
version: EM64L-G09RevD.01
frameworkgroup: C1[X(C22H29NO)]
method: RPBEPBE
basis: SDD
operation: Freq
keyword: #p
keyword: freq=noraman
keyword: PBEPBE/SDD
title: #p freq=noraman PBEPBE/SDD
converged: YES YES NO NO
title: Mulliken charges:
elementType: O N C C C C C C C C C C C C C C C C C C C C C C H H H H H H H H H H H H H H H H H H H H H H H H H H H H H
charge: -0.258189 -0.081739 -0.377024 -0.371266 -0.373132 -0.352868 -0.407227 -0.356372 -0.319154 -0.695631 0.354330 -0.336711 -0.388071 0.447634 -0.389385 -0.357900 -0.394439 0.245405 0.439038 -0.374835 -0.341669 -0.340491 -0.411588 -0.810024 0.194988 0.195237 0.189797 0.189780 0.192458 0.191569 0.188731 0.188650 0.216236 0.216730 0.195132 0.195059 0.210410 0.209551 0.209967 0.215922 0.210014 0.249796 0.251992 0.273780 0.228708 0.213535 0.248578 0.236729 0.228044 0.226933 0.227310 0.223404 0.232266
chargesum: 0.00000
title: Mulliken charges with hydrogens summed into heavy atoms:
elementType: O N C C C C C C C C C C C C C C C C C C C C C C
charge: -0.258189 -0.081739 0.013202 0.008312 0.010894 0.024513 0.025739 0.033820 0.100808 -0.059728 0.354330 -0.086915 -0.136079 0.447634 -0.115605 -0.129192 -0.180904 0.245405 0.439038 -0.126257 -0.104939 -0.112447 -0.184655 -0.127045
polarizability: 5.26900601e+02 4.11669436e+01 2.28080764e+02 -7.77420443e+00 1.06256115e+01 1.49532345e+02
1716.lowfreq: -2.1405 -0.0018 0.0008 0.0019 4.2257 9.4553 14.6576 20.4963 30.6847
frequency: 14.5058 20.4224 30.6640 40.1365 45.9209 47.9570 50.1578 56.6825 81.1132 90.1374 96.3069 113.8592 127.4657 135.5655 146.7050 157.3908 160.2109 186.9667 206.3355 217.9729 224.0118 261.3095 297.6097 324.1210 342.5124 357.8747 387.8697 409.9882 413.1071 419.5272 460.2545 472.7155 486.5119 514.5431 523.8325 540.7435 598.3794 629.1033 637.7651 717.5297 723.3312 731.8013 736.4679 744.9439 758.2265 782.6938 802.7674 818.6293 825.6576 829.5078 836.3315 840.9013 866.5120 868.8949 888.4432 942.6183 943.6914 952.4174 962.4686 968.7512 978.3851 983.2066 990.2957 994.8326 999.5329 1005.7646 1013.0464 1025.2565 1045.4633 1048.4572 1078.5664 1081.4076 1088.9534 1112.9101 1117.1435 1126.2176 1148.5921 1160.8611 1172.0715 1188.4640 1196.1444 1221.4707 1222.6226 1225.1726 1225.6625 1255.7874 1263.3751 1266.9134 1281.7697 1286.9065 1294.8816 1297.6097 1298.5774 1304.9794 1307.3640 1341.3264 1345.5945 1357.3029 1360.4703 1362.6209 1380.3236 1389.0789 1394.4143 1397.1823 1413.4352 1429.4147 1462.6970 1463.4212 1468.2040 1470.0763 1470.3727 1474.2115 1475.2151 1476.0533 1481.0564 1487.0645 1490.1578 1493.3428 1506.4268 1564.7058 1568.7512 1589.3027 1621.9683 1626.4704 2938.2931 2949.1320 2951.6099 2954.0169 2955.9768 2963.7648 2969.4953 2972.3170 2973.1983 2986.1838 2993.9005 2994.6700 3005.4939 3008.2800 3023.7834 3039.1499 3050.9042 3063.2079 3068.7272 3071.3995 3081.5231 3114.7206 3119.9220 3122.1913 3139.4322 3148.5783 3158.2241 3166.4178 3169.7329
redmass: 3.8204 4.6785 4.1155 3.4674 1.1014 2.6654 2.4965 2.7569 4.1206 2.8473 1.9154 3.7760 4.5381 1.8936 2.4470 2.1465 3.9548 3.9414 4.4555 4.1339 1.1424 4.5131 3.3440 3.4883 3.3136 3.8689 4.3525 3.0362 3.2845 3.0413 4.2950 4.2141 3.6781 2.9673 3.8136 2.5376 5.8613 7.0201 6.8509 3.0041 1.0620 1.0834 3.5178 5.0322 1.1157 5.0879 1.1670 1.5988 1.2536 5.2510 1.4474 1.5027 3.3710 1.2803 1.8987 1.1944 1.3299 1.3699 7.3599 1.3665 1.4114 1.4197 1.5073 4.6068 2.6179 2.6716 1.1131 3.6773 1.5430 3.1820 2.4889 2.2960 2.2470 1.3659 1.2724 2.9228 1.4202 1.7727 1.2495 1.6726 1.6172 2.7522 1.2982 2.1848 1.6809 2.1189 1.2650 1.2994 1.0380 1.1156 1.1098 1.3244 1.1119 1.3904 1.3358 1.4432 2.5552 1.6338 1.6324 4.1563 1.5087 1.2182 2.2987 1.2428 3.5142 4.2005 1.0722 1.0762 1.0691 1.0870 1.0537 1.1036 1.0901 1.0477 1.1098 1.1395 1.1884 1.9667 2.6173 6.7642 6.6920 5.9375 6.4289 6.5640 1.0856 1.0554 1.0588 1.0587 1.0591 1.0592 1.0587 1.0366 1.0376 1.0968 1.0991 1.0592 1.1020 1.1062 1.1046 1.1048 1.0968 1.1051 1.1007 1.0993 1.0989 1.0871 1.0889 1.0895 1.0960 1.0875 1.0956 1.0949 1.0961
irintensity: 0.0649 0.1180 0.6402 0.4531 0.3735 0.3397 0.0924 0.0435 0.4768 0.2070 0.2740 1.6136 0.4297 2.0971 0.3991 0.7917 3.6113 0.7238 1.6338 2.7345 0.0027 0.5998 0.6379 9.1861 8.2684 0.7040 1.7786 1.7047 1.3552 0.8534 9.6329 4.6882 0.6789 18.2680 2.4843 37.7828 31.7143 1.3619 0.3177 2.7266 14.3545 0.1378 4.5693 6.3877 5.8688 4.8275 0.6221 37.7118 1.1041 0.2884 18.2514 69.7712 25.3825 2.3189 2.7844 0.4468 4.2831 6.8511 122.4328 1.0977 4.4102 4.5024 12.8867 4.7474 4.9101 5.1620 0.2330 13.6138 15.3631 1.5194 2.6657 5.4957 18.7372 13.8054 13.7276 14.0668 1.2495 176.7978 91.9809 0.0904 5.4990 33.2297 24.6565 229.8835 101.2805 79.4700 0.1254 4.7368 0.0287 0.9398 0.1187 2.3408 0.0200 21.2101 2.3301 1.2878 37.6882 2.2794 0.5705 6.1412 14.5775 11.2177 44.1862 10.0473 1.3481 0.7168 0.2795 0.1865 2.4749 5.6270 12.4160 11.4791 23.2143 13.8380 10.4777 17.3359 30.8871 31.0633 206.0922 38.0239 11.7261 227.8485 170.7061 6.5899 62.6472 22.2666 0.7304 9.0843 1.5136 24.5348 149.7536 40.0275 58.4670 0.3065 1.2081 39.0595 6.5501 15.6776 0.2233 94.6077 23.2904 86.2160 106.1246 54.9872 19.8175 19.2158 32.7145 13.3023 21.4072 6.9752 8.9703 11.6612 15.1822
temp: 298.150 k
press: 1.00000 atm
elementType: 8 7 6 6 6 6 6 6 6 6 6 6 6 6 6 6 6 6 6 6 6 6 6 6 1 1 1 1 1 1 1 1 1 1 1 1 1 1 1 1 1 1 1 1 1 1 1 1 1 1 1 1 1
symmnumber: 1
zpe: 1188456.5 jmol-1
zpe.correction: 0.452659 hartree
zpe.thermalcorrener: 0.478270 hartree
zpe.thermalcorrenthalpy: 0.479214 hartree
zpe.thermalcorrgfe: 0.392655 hartree
zpe.sumelectzpe: -983.911750 hartree
zpe.sumelectthermal: -983.886139 hartree
zpe.sumelectthermalent: -983.885195 hartree
zpe.sumelectthermalfe: -983.971754 hartree
dipole: 1.8269 -0.0672 0.1547
dipole: 1.8346
quadrupole: -122.5417 -139.9830 -148.8151
quadrupole: -6.2708 -0.4444 3.0763
quadrupole: 14.5716 -2.8697 -11.7018 -6.2708 -0.4444 3.0763
hfenergy: -984.3644092 hartree
pointgroup: C01 [X(C22H29N1O1)]
dipole: 0.7185594 -0.0128929 0.0671403 debye
polarizability: 527.7180091|33.0557436|225.4593714|-20.5080364|-15.711229|151.3363295 unknown
InChI: InChI=1S/C22H29NO/c1-3-4-5-6-7-8-17-24-22-15-11-20(12-16-22)18-23-21-13-9-19(2)10-14-21/h9-16,18H,3-8,17H2,1-2H3
charge 0 multiplicity 1
53 atoms
O  2.134878 1.194643 -0.707544
N  -4.161588 -0.41586 -0.031084
C  6.971997 0.065312 -0.195725
C  8.028432 -0.93117 0.332015
C  5.519467 -0.392068 0.066787
C  9.481763 -0.481116 0.061427
C  4.47181 0.622014 -0.447373
C  10.538979 -1.473431 0.597406
C  3.040712 0.141851 -0.201392
C  11.987995 -1.018106 0.319991
C  0.756116 0.982335 -0.612202
C  0.157049 -0.187001 -0.066174
C  -0.058521 2.033178 -1.108052
C  -2.075656 0.749058 -0.518292
C  -1.244286 -0.293445 -0.024362
C  -1.456037 1.91296 -1.058907
C  -3.539798 0.648678 -0.482826
C  -5.577419 -0.460941 0.067452
C  -8.427574 -0.722516 0.292467
C  -6.210815 -1.721817 -0.114189
C  -6.388768 0.663698 0.394166
C  -7.609345 -1.842807 -0.018866
C  -7.788429 0.525608 0.504679
C  -9.933237 -0.872165 0.424807
H  7.135145 1.056667 0.275977
H  7.11813 0.212037 -1.286124
H  7.86049 -1.925168 -0.133416
H  7.886208 -1.071755 1.424186
H  5.379167 -0.552044 1.15642
H  5.355298 -1.377542 -0.417613
H  9.628118 -0.347016 -1.030979
H  9.650307 0.515272 0.521382
H  4.61074 0.79376 -1.53199
H  4.61341 1.598736 0.053754
H  10.394008 -1.605067 1.68928
H  10.368347 -2.469322 0.139484
H  2.852722 -0.016112 0.881129
H  2.841326 -0.808026 -0.739883
H  12.1922 -0.038109 0.791455
H  12.723979 -1.742723 0.714423
H  12.168518 -0.910461 -0.766363
H  0.771117 -1.004873 0.321595
H  0.427528 2.921516 -1.522161
H  -1.728622 -1.18392 0.389422
H  -2.082204 2.727394 -1.444461
H  -4.090881 1.525336 -0.888277
H  -5.580161 -2.587837 -0.340232
H  -5.920056 1.63408 0.597076
H  -8.077784 -2.822075 -0.178673
H  -8.395827 1.39998 0.769623
H  -10.366012 -1.388437 -0.45226
H  -10.431069 0.108368 0.519762
H  -10.201664 -1.470144 1.317252
