program: Gaussian 09
title: 000298651
version: EM64L-G09RevD.01
frameworkgroup: C1[X(C21H15Cl)]
method: RPBEPBE
basis: SDD
operation: Freq
keyword: #p
keyword: freq=noraman
keyword: PBEPBE/SDD
title: #p freq=noraman PBEPBE/SDD
converged: YES YES NO NO
title: Mulliken charges:
elementType: Cl C C C C C C C C C C C C C C C C C C C C C H H H H H H H H H H H H H H H
charge: -0.085498 -0.795726 0.270239 0.082635 0.392599 0.137520 0.286239 0.293167 -0.412558 -0.389657 -0.237289 -0.239226 -0.383678 -0.368845 -0.421601 -0.381297 -0.240672 -0.255144 -0.236598 -0.223433 -0.248432 -0.243304 0.313030 0.258834 0.265370 0.229752 0.228560 0.256615 0.255872 0.258106 0.261178 0.227679 0.225805 0.229028 0.230481 0.229165 0.231085
chargesum: 0.00000
title: Mulliken charges with hydrogens summed into heavy atoms:
elementType: Cl C C C C C C C C C C C C C C C C C C C C C
charge: -0.085498 -0.482696 0.270239 0.082635 0.392599 0.137520 0.286239 0.293167 -0.153724 -0.124287 -0.007537 -0.010666 -0.127063 -0.112973 -0.163495 -0.120119 -0.012993 -0.029340 -0.007570 0.007047 -0.019267 -0.012219
polarizability: 3.29316367e+02 1.90004114e+01 2.95432271e+02 -1.12524774e+01 -1.33958086e+01 1.35718973e+02
1716.lowfreq: -6.2786 -0.0022 -0.0022 -0.0009 1.7011 4.1466 23.5466 39.8235 57.3997
frequency: 23.3895 39.8209 57.3904 66.7070 68.0942 99.5484 113.8832 144.6531 191.6332 202.5217 234.7256 257.5239 275.6945 304.3707 338.1931 386.8172 401.7400 403.8747 427.6452 463.0872 503.6281 530.6200 565.2951 598.9776 607.0206 615.0192 622.1234 628.0317 659.4435 693.6261 698.8735 704.4442 720.4634 756.1606 766.4159 777.2811 789.7809 815.9628 852.5500 859.8013 873.5308 887.4191 927.3590 928.2735 935.3411 950.8088 981.2051 982.5861 987.7800 988.0925 988.9034 996.3967 998.7422 1015.9717 1025.8615 1028.1994 1048.9091 1081.9372 1088.9873 1098.7433 1142.4934 1166.5878 1168.5934 1173.6146 1174.9051 1183.2408 1191.1789 1202.7947 1211.6986 1251.2959 1292.4896 1317.3355 1326.7808 1355.8995 1370.2465 1373.4198 1408.2357 1432.2418 1435.9007 1448.0743 1464.6266 1475.7807 1490.6698 1563.4593 1577.8666 1582.9791 1598.8163 1608.8930 1610.3978 1616.6196 3096.7146 3124.6475 3124.8455 3129.4101 3132.0740 3135.5793 3141.0211 3144.0563 3152.1543 3152.6202 3153.9713 3162.5878 3166.2942 3166.9613 3170.5937
redmass: 4.0972 7.9048 4.1123 4.6413 5.2401 5.0362 4.7757 9.5779 5.6724 4.9887 5.3268 5.1342 5.9658 6.0482 5.0594 4.8819 2.9055 2.8619 3.2065 4.9413 3.8507 3.7479 6.1767 7.0302 5.8031 5.9762 5.4314 5.1667 6.3496 4.9740 1.7327 1.9234 2.8722 2.3886 1.4170 2.7402 2.5170 4.5643 1.2509 1.2502 3.1627 1.6891 1.4816 1.8522 3.0113 1.4276 1.4532 1.3757 3.7278 2.1420 2.6210 1.3206 1.3233 3.1332 2.3074 2.1796 2.2102 1.6418 1.8231 1.8185 1.1352 2.3796 1.1812 1.0574 1.0835 1.4355 1.1332 1.1273 2.3264 3.3378 1.6905 1.4275 1.4833 3.0162 6.2551 5.2634 4.8645 2.3358 2.3836 2.4194 3.3408 2.2827 2.4599 6.9780 5.7606 6.5651 7.0227 5.9594 6.3797 6.8965 1.0884 1.0849 1.0848 1.0854 1.0877 1.0892 1.0902 1.0927 1.0938 1.0952 1.0958 1.0950 1.1006 1.1012 1.0994
irintensity: 0.0469 0.3840 0.0271 0.5611 0.8371 0.1764 0.2312 1.3507 1.0190 1.6500 1.1219 0.6596 0.8227 3.4183 0.2583 3.2531 0.0729 0.6666 2.2247 15.0865 6.1304 25.1698 12.9865 12.7112 2.9420 2.8102 14.1018 5.7888 1.0483 20.7951 40.5510 45.2791 30.3897 22.9966 76.1036 39.3133 16.3932 4.1168 0.4355 0.8897 4.5125 0.5752 1.7764 3.3009 3.0538 1.0315 0.2281 0.5386 0.9880 0.0758 0.1057 0.0577 0.2379 4.8717 12.6584 10.8518 8.1015 5.7889 6.9031 3.1331 15.8157 11.1808 4.1752 0.1140 0.9313 0.4059 1.0685 2.3758 0.3536 5.4111 1.6032 0.8229 1.5615 25.3119 0.8493 0.3230 8.6193 11.3604 5.4723 7.2012 14.8600 17.5684 11.3786 2.2146 4.7405 2.5238 1.8161 2.8463 0.1168 13.4983 5.3583 3.1694 0.7353 2.0971 2.1357 12.7096 10.4267 20.5159 25.4902 7.9554 29.7271 19.4940 36.1453 20.6239 19.6623
temp: 298.150 k
press: 1.00000 atm
elementType: 17 6 6 6 6 6 6 6 6 6 6 6 6 6 6 6 6 6 6 6 6 6 1 1 1 1 1 1 1 1 1 1 1 1 1 1 1
symmnumber: 1
zpe: 756354.2 jmol-1
zpe.correction: 0.288080 hartree
zpe.thermalcorrener: 0.305576 hartree
zpe.thermalcorrenthalpy: 0.306520 hartree
zpe.thermalcorrgfe: 0.241045 hartree
zpe.sumelectzpe: -1267.819027 hartree
zpe.sumelectthermal: -1267.801532 hartree
zpe.sumelectthermalent: -1267.800587 hartree
zpe.sumelectthermalfe: -1267.866062 hartree
dipole: -0.2685 2.0460 -1.5180
dipole: 2.5617
quadrupole: -118.7624 -121.9735 -137.5523
quadrupole: 0.2425 -4.8200 1.9299
quadrupole: 7.3337 4.1226 -11.4562 0.2425 -4.8200 1.9299
hfenergy: -1268.1071074 hartree
pointgroup: C01 [X(C21H15Cl1)]
dipole: -0.1528125 0.6352547 -0.767396 debye
polarizability: 326.9394043|18.046491|282.6304021|-14.557144|-49.3389345|150.8978045 unknown
InChI: InChI=1S/C21H15Cl/c22-21-18-14-8-7-13-17(18)19(15-9-3-1-4-10-15)20(21)16-11-5-2-6-12-16/h1-14,21H
charge 0 multiplicity 1
37 atoms
Cl 1.275263 -2.584109 2.133941
C  1.11101 -1.903311 0.306727
C  -0.053368 -0.930463 0.179473
C  0.457695 0.34681 -0.046924
C  2.34306 -1.081924 0.01935
C  1.939014 0.271925 -0.162083
C  -1.459529 -1.389981 0.146334
C  -0.282775 1.630263 -0.124286
C  3.69042 -1.457234 -0.042283
C  2.903913 1.273868 -0.391559
C  4.661832 -0.452225 -0.30066
C  4.269862 0.896846 -0.464928
C  -2.449349 -0.68869 -0.607234
C  -1.856699 -2.591358 0.805089
C  -0.074046 2.536859 -1.200364
C  -1.187967 1.997765 0.910243
C  -3.776597 -1.155105 -0.677173
C  -3.187191 -3.055149 0.734714
C  -0.76491 3.767735 -1.249711
C  -1.868852 3.231613 0.865325
C  -4.158017 -2.339095 -0.00188
C  -1.662981 4.121515 -0.216149
H  0.997875 -2.837603 -0.262193
H  3.994723 -2.496357 0.121814
H  2.61215 2.322939 -0.502953
H  5.721791 -0.721936 -0.360611
H  5.032491 1.662449 -0.64656
H  -2.171052 0.214332 -1.157768
H  -1.123525 -3.152543 1.392113
H  0.607661 2.261389 -2.013128
H  -1.345212 1.311024 1.748733
H  -4.513138 -0.599532 -1.268573
H  -3.465476 -3.976547 1.258653
H  -0.602327 4.448405 -2.092904
H  -2.558146 3.500694 1.673358
H  -5.19103 -2.700259 -0.056805
H  -2.194673 5.078892 -0.25134
