program: Gaussian 09
title: 000298623
version: EM64L-G09RevD.01
frameworkgroup: C1[X(C9H5Cl2N)]
method: RPBEPBE
basis: SDD
operation: Freq
keyword: #p
keyword: freq=noraman
keyword: PBEPBE/SDD
title: #p freq=noraman PBEPBE/SDD
converged: NO NO NO YES
title: Mulliken charges:
elementType: Cl Cl N C C C C C C C C C H H H H H
charge: -0.039616 -0.023634 0.081509 0.520510 0.392007 -0.301607 -0.372093 -0.292799 -0.443296 -0.235955 -0.217233 -0.352841 0.264217 0.261218 0.262911 0.242279 0.254423
chargesum: 0.00000
title: Mulliken charges with hydrogens summed into heavy atoms:
elementType: Cl Cl N C C C C C C C C C
charge: -0.039616 -0.023634 0.081509 0.520510 0.392007 -0.301607 -0.107875 -0.031582 -0.443296 0.026956 0.025046 -0.098418
polarizability: 1.67855124e+02 -1.08410087e+00 1.49642009e+02 -5.36467156e-04 -5.76852703e-04 4.46782870e+01
1716.lowfreq: -7.4400 -6.9908 0.0015 0.0028 0.0034 6.5861 64.4247 171.0608 175.8677
frequency: 64.4182 171.0582 175.8676 179.7699 229.5261 252.8967 352.6360 390.6280 459.4946 474.4419 476.6970 492.7173 552.7108 575.0990 655.7895 725.5995 754.2991 766.3529 814.4029 825.2446 853.4037 921.0831 969.5959 976.7775 988.5599 1047.0111 1074.7753 1157.2778 1191.1083 1205.6500 1235.4148 1315.3927 1358.3201 1386.9057 1399.1580 1434.9611 1474.6980 1549.9363 1561.4134 1618.7018 3150.4335 3160.3572 3169.2497 3181.3140 3186.4614
redmass: 11.6446 6.0487 4.6855 13.1760 14.2852 4.4551 10.3940 12.3578 3.6154 5.1790 5.5576 8.7584 8.0700 3.5297 5.6370 8.7053 1.9952 6.7319 2.0339 5.3288 1.3856 1.3945 1.3868 9.0486 1.3397 2.7849 1.9958 1.6305 1.7986 1.5574 2.0863 2.3157 3.3365 4.7386 2.9187 2.3993 3.6995 8.0210 6.0733 7.5824 1.0874 1.0887 1.0927 1.0989 1.0979
irintensity: 1.2589 0.2166 0.2648 1.2896 0.1342 6.8067 0.4506 19.2134 0.2617 4.5882 1.4369 2.0872 0.2887 1.4409 0.2661 114.4010 20.3941 4.4724 42.7158 4.1753 54.6681 0.0233 0.0300 2.3477 1.3843 7.7994 2.3222 45.5431 55.9303 1.0229 22.3207 110.8216 0.9722 17.6079 22.7717 4.5280 47.4980 4.4869 65.2159 4.1560 5.4112 9.1402 0.5344 7.7757 8.6124
temp: 298.150 k
press: 1.00000 atm
elementType: 17 17 7 6 6 6 6 6 6 6 6 6 1 1 1 1 1
symmnumber: 1
zpe: 298812.9 jmol-1
zpe.correction: 0.113812 hartree
zpe.thermalcorrener: 0.123238 hartree
zpe.thermalcorrenthalpy: 0.124182 hartree
zpe.thermalcorrgfe: 0.078098 hartree
zpe.sumelectzpe: -1320.010737 hartree
zpe.sumelectthermal: -1320.001311 hartree
zpe.sumelectthermalent: -1320.000367 hartree
zpe.sumelectthermalfe: -1320.046451 hartree
dipole: 2.5543 1.6900 0.0000
dipole: 3.0628
quadrupole: -92.5618 -70.3300 -85.5184
quadrupole: -1.6960 0.0000 -0.0001
quadrupole: -9.7584 12.4734 -2.7150 -1.6960 0.0000 -0.0001
hfenergy: -1320.124549 hartree
pointgroup: C01 [X(C9H5Cl2N1)]
dipole: 1.1692823 -0.2911679 -0.0000027 debye
dipolederiv: -0.4632503 -0.3035135 -0.000003 -0.3939495 -0.4398806 -0.0000026 -0.0000029 -0.0000012 -0.0553227 -0.5246161 -0.3824997 0. -0.4593113 -0.5493766 0. 0.0000013 0.0000005 -0.0900044 -0.3639641 0.2463232 -0.000001 -0.246253 -0.7698504 0.0000018 -0.0000023 0.0000023 -0.170241 -0.0622991 -0.3375658 0.0000012 -0.1310142 0.0173362 -0.0000022 0.0000019 -0.0000036 0.0671794 -0.388871 -0.253611 -0.0000018 -0.1764511 -0.0592477 0.0000001 -0.0000015 0.0000008 0.0911612 0.6370882 0.598833 0.0000052 0.6944003 0.5507085 0.000005 0.0000052 0.0000029 -0.084289 -0.0373141 0.1485131 0.0000015 -0.0262524 -0.0753309 0.0000014 0.0000017 0.0000044 -0.1353249 -0.1482407 0.2268062 -0.0000016 -0.0234617 -0.1547451 0. -0.000001 0.0000011 -0.1118531 0.9853366 0.4517264 0.0000004 0.7410015 1.0304544 0. -0.0000004 -0.0000021 0.0108188 -0.012308 -0.0516285 0.0000002 -0.1337138 -0.1625155 -0.0000011 -0.0000016 0.0000013 -0.083356 -0.0225038 -0.0807111 0.0000028 -0.0028098 0.1418922 -0.0000022 0.0000031 -0.0000055 -0.1459474 0.1920596 -0.213613 0.0000008 0.1140023 0.4367262 -0.0000045 0.0000003 -0.0000047 -0.0974279 0.0664726 -0.0830973 -0.0000015 -0.0264932 0.0422869 -0.0000007 -0.0000013 -0.0000015 0.1639405 0.0623645 -0.0976652 0.0000006 -0.0251845 0.0328141 0.0000011 -0.0000008 0.0000008 0.1648427 -0.0369257 0.0177694 -0.0000015 0.0122301 0.1080562 0. -0.0000009 0. 0.1644821 0.0504092 0.0532664 -0.0000015 0.0543318 -0.0724351 0.0000017 -0.0000022 0.0000026 0.1610548 0.0665623 0.0606674 -0.0000005 0.0289286 -0.0768928 0.0000019 0.0000012 0.0000018 0.1502867 unknown
polarizability: 165.1420959|6.5747582|152.355037|0.0006983|-0.0003646|44.678287 unknown
InChI: InChI=1S/C9H5Cl2N/c10-8-3-1-2-7-6(8)4-5-12-9(7)11/h1-5H
charge 0 multiplicity 1
17 atoms
Cl 3.062238 1.658955 0.000015
Cl -3.067389 -1.609695 -0.00001
N  -2.350905 0.98669 -0.000015
C  0.464333 0.568093 -0.000011
C  -0.445569 -0.567549 -0.000013
C  1.867416 0.27774 0.000006
C  0.067086 -1.901578 -0.000005
C  -0.08633 1.891471 -0.000021
C  -1.847949 -0.233742 -0.000013
C  2.361538 -1.024398 0.000015
C  1.446828 -2.121518 0.000008
C  -1.470113 2.054456 -0.000025
H  -0.635262 -2.739453 -0.000014
H  0.575179 2.760947 -0.000025
H  3.440667 -1.203378 0.000023
H  1.843849 -3.141504 0.000019
H  -1.932716 3.045463 -0.000033
