program: Gaussian 09
title: 000298652
version: EM64L-G09RevD.01
frameworkgroup: C1[X(C22H18)]
method: RPBEPBE
basis: SDD
operation: Freq
keyword: #p
keyword: freq=noraman
keyword: PBEPBE/SDD
title: #p freq=noraman PBEPBE/SDD
converged: YES YES NO NO
title: Mulliken charges:
elementType: C C C C C C C C C C C C C C C C C C C C C C H H H H H H H H H H H H H H H H H H
charge: -0.560675 0.151955 0.276683 0.089579 0.179086 0.518744 0.299692 -0.424513 -0.414609 -0.819575 -0.436239 -0.381219 -0.238470 -0.239931 -0.388669 -0.411790 -0.233638 -0.227097 -0.251957 -0.243293 -0.251263 -0.248983 0.252368 0.248319 0.241964 0.230156 0.261167 0.229023 0.233899 0.247803 0.224152 0.222721 0.258232 0.248297 0.225852 0.225269 0.226110 0.225232 0.227414 0.228204
chargesum: 0.00000
title: Mulliken charges with hydrogens summed into heavy atoms:
elementType: C C C C C C C C C C C C C C C C C C C C C C
charge: -0.308307 0.151955 0.276683 0.089579 0.179086 0.518744 0.299692 -0.176194 -0.172645 -0.099229 -0.202340 -0.133416 -0.014317 -0.017210 -0.130437 -0.163493 -0.007785 -0.001828 -0.025847 -0.018062 -0.023849 -0.020779
polarizability: 3.17105268e+02 -1.98937328e+01 2.60300929e+02 7.24370606e+00 -9.20768947e+00 1.49762285e+02
1716.lowfreq: -7.8552 -0.0009 -0.0007 -0.0005 3.2665 5.3462 21.6822 41.0522 54.8032
frequency: 21.4167 40.9869 54.8010 58.4940 69.0383 88.0851 144.1135 173.1779 200.1032 219.9774 232.9565 244.7091 261.5256 280.3709 317.4797 374.6441 402.0086 406.1734 428.4827 452.2679 484.7988 523.0674 529.3456 570.5140 587.1885 612.3409 613.8415 621.5860 638.3497 671.3643 702.8814 704.5135 732.8899 748.5798 762.8631 766.5919 774.5353 812.6506 832.6936 850.8568 855.8619 873.7916 885.2970 923.3609 925.5218 944.6591 976.1826 978.5704 982.6822 983.8882 990.6332 991.7651 994.8051 995.5100 1016.8457 1024.4114 1033.3328 1039.5743 1057.5841 1072.2485 1080.0177 1093.8526 1111.0719 1164.2283 1171.0775 1172.0622 1180.4697 1187.8808 1189.0556 1195.2705 1200.8146 1238.6882 1258.7708 1294.2132 1315.5687 1332.2030 1344.8326 1368.5386 1380.1211 1398.4658 1403.8433 1431.1378 1440.9423 1447.1335 1461.2933 1469.9646 1474.2147 1480.1989 1483.5776 1573.4329 1587.4038 1591.6592 1605.5590 1608.1472 1609.7866 1614.7847 2967.1391 2969.7994 3037.6533 3094.2204 3117.0470 3120.5700 3121.5437 3122.4891 3128.8015 3131.4612 3135.0349 3141.2886 3145.1871 3146.2799 3159.1151 3159.5071 3162.7610 3175.1649
redmass: 4.0053 3.8672 4.5633 4.1551 4.3773 4.5709 3.2211 2.1012 1.8271 4.1345 3.9189 3.7219 3.7022 3.3464 4.8355 3.8778 2.8040 2.8474 3.1445 3.9233 3.9489 4.4348 3.8796 5.5887 3.6843 6.1885 5.9109 4.3952 5.1935 5.7960 1.7566 1.7588 2.0214 3.2983 2.2182 1.9199 2.2489 3.2627 3.2128 1.2481 1.2476 1.7586 2.8440 1.4505 1.5097 1.4344 1.3962 1.4169 1.3565 3.2636 5.9992 3.4830 1.3183 1.3669 2.2626 2.3489 1.9167 1.5835 3.2210 2.3235 1.6426 1.9262 1.7420 1.2565 1.0609 1.0531 1.4799 1.1714 1.5042 1.1265 1.4147 2.5517 2.4973 1.9648 1.5168 1.2875 3.1971 5.4582 7.9811 1.2839 5.2165 2.3231 2.1697 2.4370 2.1716 1.1928 1.2066 2.2356 2.2047 5.5859 6.6391 6.2686 7.2345 6.4440 6.1259 6.9744 1.0392 1.0815 1.0961 1.0969 1.0864 1.0849 1.0845 1.0865 1.0894 1.0886 1.0915 1.0946 1.0961 1.0937 1.0985 1.1000 1.1014 1.0959
irintensity: 0.0962 0.0096 0.0349 0.1867 0.5225 0.1264 0.7419 0.6712 0.3063 1.3507 3.6749 0.6136 0.3218 0.5245 0.0664 1.5151 0.0254 0.1611 1.9119 2.1528 1.4265 13.7757 6.4236 3.7606 2.5563 0.2075 1.4245 14.3716 2.9416 2.8307 32.1614 54.4789 45.5303 19.4143 29.9232 28.6840 51.6958 8.4846 1.7795 0.3781 0.2733 1.7573 0.1447 0.8253 1.7968 1.4825 0.3813 1.0425 0.0922 5.3863 0.4207 4.2242 0.0140 0.9814 9.8574 5.3318 6.4126 2.5924 4.6801 2.7966 10.6636 2.5035 8.1437 1.1101 0.1260 0.0917 0.2202 1.1958 4.7973 1.5399 2.5549 1.1278 2.3703 1.2940 0.1893 2.5572 2.5778 1.0382 0.1215 17.1303 14.8839 5.0636 10.9008 5.7308 9.1411 6.1905 18.2432 21.8569 26.8974 0.5689 0.3186 2.2404 4.3986 8.0140 10.1068 14.1634 31.1188 10.6981 18.8224 15.0803 6.7033 2.1618 1.7794 0.6052 3.9526 7.4230 13.0916 30.0777 35.8116 32.0951 49.5063 27.6281 26.4814 9.5036
temp: 298.150 k
press: 1.00000 atm
elementType: 6 6 6 6 6 6 6 6 6 6 6 6 6 6 6 6 6 6 6 6 6 6 1 1 1 1 1 1 1 1 1 1 1 1 1 1 1 1 1 1
symmnumber: 1
zpe: 852663.1 jmol-1
zpe.correction: 0.324762 hartree
zpe.thermalcorrener: 0.342512 hartree
zpe.thermalcorrenthalpy: 0.343456 hartree
zpe.thermalcorrgfe: 0.277809 hartree
zpe.sumelectzpe: -847.651869 hartree
zpe.sumelectthermal: -847.634120 hartree
zpe.sumelectthermalent: -847.633176 hartree
zpe.sumelectthermalfe: -847.698822 hartree
dipole: -0.2976 0.0298 0.0823
dipole: 0.3102
quadrupole: -121.8282 -114.2992 -127.1145
quadrupole: -1.3150 1.8182 -2.1444
quadrupole: -0.7476 6.7814 -6.0338 -1.3150 1.8182 -2.1444
hfenergy: -847.9766317 hartree
pointgroup: C01 [X(C22H18)]
dipole: -0.1162844 -0.0009567 -0.0370647 debye
polarizability: 320.4999729|14.9971303|257.4732839|-0.9823462|-6.4574011|149.1952257 unknown
InChI: InChI=1S/C22H18/c1-16-19-14-8-9-15-20(19)22(18-12-6-3-7-13-18)21(16)17-10-4-2-5-11-17/h2-15,22H,1H3
charge 0 multiplicity 1
40 atoms
C  0.413227 -0.237655 0.747136
C  -0.324647 0.937627 0.058022
C  1.879338 0.176081 0.623072
C  0.591668 1.872181 -0.398839
C  1.95756 1.423358 -0.059574
C  0.144253 -1.641799 0.193815
C  -1.801824 1.059375 0.029826
C  3.038848 -0.484205 1.056266
C  3.211312 2.029324 -0.302463
C  0.333106 3.147876 -1.161044
C  -0.383867 -2.657599 1.027678
C  0.441374 -1.955508 -1.158381
C  4.299213 0.123897 0.815667
C  4.38156 1.369397 0.144658
C  -2.650639 -0.042387 -0.282762
C  -2.422709 2.304318 0.347769
C  -0.617204 -3.959097 0.525216
C  0.207622 -3.251752 -1.663914
C  -4.054592 0.1009 -0.289374
C  -3.826162 2.446622 0.34115
C  -0.324172 -4.260482 -0.823727
C  -4.652324 1.344692 0.019894
H  0.121433 -0.241997 1.818884
H  2.977728 -1.454715 1.561916
H  3.283096 2.991316 -0.822642
H  0.515854 4.042223 -0.532813
H  -0.701837 3.200646 -1.535103
H  1.018174 3.222666 -2.027211
H  -0.620371 -2.426848 2.073922
H  0.857214 -1.177902 -1.81001
H  5.216818 -0.373944 1.148906
H  5.363651 1.823105 -0.031905
H  -2.209793 -1.008314 -0.54285
H  -1.79534 3.153958 0.638387
H  -1.027803 -4.732648 1.184115
H  0.440411 -3.478775 -2.710642
H  -4.682789 -0.761103 -0.541555
H  -4.274938 3.413095 0.597943
H  -0.505036 -5.26728 -1.216653
H  -5.742817 1.452152 0.015922
