program: Gaussian 09
title: 000298612
version: EM64L-G09RevD.01
frameworkgroup: C1[X(C8H10OS)]
method: RPBEPBE
basis: SDD
operation: Freq
keyword: #p
keyword: freq=noraman
keyword: PBEPBE/SDD
title: #p freq=noraman PBEPBE/SDD
converged: NO YES NO NO
title: Mulliken charges:
elementType: S O C C C C C C C C H H H H H H H H H H
charge: 0.293560 -0.229586 0.471988 -0.272174 -0.205066 -0.361829 -0.813759 -0.762554 0.218151 -0.767929 0.260150 0.237479 0.237272 0.237445 0.240898 0.240896 0.240328 0.237195 0.236948 0.260586
chargesum: 0.00000
title: Mulliken charges with hydrogens summed into heavy atoms:
elementType: S O C C C C C C C C
charge: 0.293560 -0.229586 0.471988 -0.272174 -0.205066 -0.101679 -0.101562 -0.040431 0.218151 -0.033201
polarizability: 1.53979675e+02 -2.08108652e+00 1.13816092e+02 -2.39586058e-02 -2.28290191e-02 5.61592530e+01
1716.lowfreq: -6.1248 -0.0033 -0.0023 -0.0016 11.2609 11.9337 37.4036 53.8685 75.9716
frequency: 37.3305 53.8116 75.9325 98.1219 110.4856 143.2051 193.6874 258.9322 295.6225 318.6999 337.6359 451.7247 457.6590 510.0685 570.8198 601.6156 613.1486 633.8771 692.2878 858.5350 872.2985 911.6147 990.0983 1015.8954 1017.7878 1024.9967 1044.2411 1104.0599 1182.0362 1204.5268 1265.4823 1368.6307 1379.4568 1398.7353 1404.7130 1448.7760 1459.6420 1461.1160 1461.6206 1477.2785 1479.8992 1498.0574 1564.4270 1583.8919 2977.8957 2979.4816 2989.2350 3054.3878 3055.4716 3076.8975 3091.0758 3094.5152 3125.9503 3162.7131
redmass: 1.0313 1.0282 2.4097 1.3202 3.8175 4.5378 3.5076 2.5966 3.9951 4.1326 3.9771 5.7675 4.4354 6.3346 4.0378 3.2308 2.9372 3.6796 6.4982 2.7919 1.3619 3.4193 1.4335 1.8700 1.4221 1.6547 1.5235 2.0874 3.8078 1.4864 5.9925 1.2605 3.4104 1.2989 1.3150 1.1042 1.2270 1.0452 1.0489 1.2878 1.0450 2.6257 6.0563 6.4606 1.0378 1.0377 1.0366 1.0979 1.0982 1.0976 1.0977 1.0973 1.0998 1.0944
irintensity: 0.0819 0.0304 5.1256 0.1020 0.3454 4.2869 0.2079 0.6389 5.5969 0.0896 4.3807 1.1300 4.2724 3.6565 18.3096 0.1868 7.1248 1.2318 0.5238 2.4549 20.9532 31.4826 18.2134 7.4703 10.3106 0.4047 2.8300 13.7263 9.5403 40.7348 129.5776 50.6602 8.4400 5.2352 15.1248 31.1354 7.7598 14.1670 32.3591 21.4917 1.1286 168.1832 118.0508 88.6062 19.2590 39.1412 4.9792 24.5534 10.2146 14.0810 17.5935 8.0101 13.2976 4.3022
temp: 298.150 k
press: 1.00000 atm
elementType: 16 8 6 6 6 6 6 6 6 6 1 1 1 1 1 1 1 1 1 1
symmnumber: 1
zpe: 409960.9 jmol-1
zpe.correction: 0.156146 hartree
zpe.thermalcorrener: 0.167779 hartree
zpe.thermalcorrenthalpy: 0.168723 hartree
zpe.thermalcorrgfe: 0.117314 hartree
zpe.sumelectzpe: -783.383471 hartree
zpe.sumelectthermal: -783.371837 hartree
zpe.sumelectthermalent: -783.370893 hartree
zpe.sumelectthermalfe: -783.422302 hartree
dipole: -3.8541 3.6279 0.0010
dipole: 5.2930
quadrupole: -65.2075 -65.1755 -68.4720
quadrupole: 9.5910 -0.0118 0.0014
quadrupole: 1.0775 1.1095 -2.1870 9.5910 -0.0118 0.0014
hfenergy: -783.5396164 hartree
pointgroup: C01 [X(C8H10O1S1)]
dipole: 1.5687332 -1.3693081 -0.0242305 debye
dipolederiv: -0.0389083 0.0463735 0.0030403 0.027913 -0.2663939 0.0018951 0.0027638 0.0014596 0.1252839 -1.0115014 0.105739 0.0135659 0.4606065 -0.6910989 -0.0062029 0.0139914 -0.0007446 -0.3196872 -0.2469577 -0.2959683 0.0060553 -0.6029839 -0.1005966 0.012847 0.0075424 0.0063258 -0.0385578 0.3101903 -0.0473488 -0.008837 0.3236327 0.2839678 -0.0093542 -0.0112571 -0.0016631 -0.1658725 -1.1384944 0.115578 0.0202073 0.2761759 0.2478252 -0.0081685 0.0187256 -0.0049654 -0.154099 0.3981494 0.2128652 -0.0122853 -0.0847092 -0.1447647 0.0017157 -0.0110263 -0.0041675 -0.1431186 0.0253722 0.0363455 0.0010586 0.0867874 -0.0334276 -0.0010231 0.0009117 -0.0001001 0.0885997 -0.1907128 -0.0933719 0.0060775 0.0192274 0.0256953 -0.0000624 0.0054381 0.0021536 0.0863374 1.8913777 0.0493068 -0.0380517 -0.1240267 0.8176086 -0.0032723 -0.0390906 -0.0058096 0.1443676 -0.1784196 -0.1926111 0.0069208 -0.3041065 -0.3463162 0.0103235 0.0091262 0.0089331 0.057695 0.1086096 -0.0425049 0.0014602 -0.0779326 -0.0508752 0.0029528 0.0016559 0.0022074 0.1706953 0.0626916 0.0163055 -0.0375245 0.060788 -0.016991 -0.1009864 0.0197406 -0.1328243 -0.0391968 -0.1037476 -0.0318055 0.0042693 -0.1306723 0.0537092 0.0028507 0.0048063 0.0009183 0.1027453 0.0632783 0.0218593 0.0332817 0.0644393 -0.0144883 0.0981937 -0.0245431 0.1318459 -0.0422156 -0.0388542 -0.0221996 -0.0838052 -0.0129356 0.0808376 0.0668566 -0.1137503 0.0284059 -0.0275279 -0.0311124 -0.0223619 0.0843358 -0.0143416 0.0797494 -0.0674977 0.1141162 -0.028758 -0.0342578 0.0928744 0.0866248 0.000067 -0.0236821 -0.0935779 0.0016921 0.0007088 -0.0004901 0.1213335 0.064675 0.0371966 -0.086876 0.0057697 0.0433116 0.0714581 -0.0427608 0.0899661 -0.0251043 0.071391 0.034121 0.0814558 0.0026547 0.0404198 -0.0732729 0.0374943 -0.0932843 -0.0291086 -0.1099013 -0.0141432 0.0055844 0.0473959 0.0854058 -0.0009447 0.0054068 0.0005911 0.1216884 unknown
polarizability: 154.0367245|-0.5739329|113.7145832|-2.0403652|-0.3222928|56.2037127 unknown
InChI: InChI=1S/C8H10OS/c1-5-4-8(6(2)9)10-7(5)3/h4H,1-3H3
charge 0 multiplicity 1
20 atoms
S  0.11201 1.593933 -0.008305
O  -2.91557 1.192764 0.060758
C  1.447752 -0.711746 -0.021541
C  1.660385 0.67213 -0.033578
C  -0.819422 0.041207 0.019881
C  0.050539 -1.050787 0.008664
C  2.556203 -1.74287 -0.037851
C  2.969158 1.417526 -0.063714
C  -2.287795 0.088024 0.050399
C  -3.033251 -1.246855 0.079924
H  -0.307301 -2.084614 0.022074
H  2.476843 -2.400657 -0.92357
H  3.553235 -1.272739 -0.060083
H  2.511958 -2.391041 0.857359
H  3.590117 1.168956 0.817671
H  3.555102 1.158916 -0.965952
H  2.818069 2.509676 -0.066904
H  -2.752063 -1.837751 0.970921
H  -2.796726 -1.852063 -0.814405
H  -4.115041 -1.046311 0.105351
