program: Gaussian 09
title: 000298726
version: EM64L-G09RevD.01
frameworkgroup: C1[X(C27H24OSi)]
method: RPBEPBE
basis: SDD
operation: Freq
keyword: #p
keyword: freq=noraman
keyword: PBEPBE/SDD
title: #p freq=noraman PBEPBE/SDD
converged: YES YES NO NO
title: Mulliken charges:
elementType: Si O C C C C C C C C C C C C C C C C C C C C C C C C C C C H H H H H H H H H H H H H H H H H H H H H H H H
charge: 1.416689 -0.458153 -0.031353 -0.178156 -0.187764 -0.173545 -0.388983 -0.331298 -0.331331 -0.305568 -0.283202 -0.308965 -0.334837 0.441296 -0.691241 -0.254664 -0.256584 -0.239310 -0.240762 -0.241510 -0.250761 -0.431890 -0.371443 -0.235679 -0.237157 -0.233151 -0.236620 -0.215346 -0.244209 0.232435 0.252961 0.263923 0.251482 0.238797 0.250518 0.256993 0.260768 0.235765 0.228635 0.231252 0.226139 0.226210 0.227714 0.228439 0.346105 0.251973 0.259589 0.227483 0.228483 0.227958 0.228389 0.224814 0.228674
chargesum: 0.00000
title: Mulliken charges with hydrogens summed into heavy atoms:
elementType: Si O C C C C C C C C C C C C C C C C C C C C C C C C C C C
charge: 1.416689 -0.112048 -0.031353 -0.178156 -0.187764 -0.173545 -0.156548 -0.078338 -0.067407 -0.054086 -0.044406 -0.058447 -0.077844 0.441296 -0.194708 -0.026029 -0.025333 -0.013171 -0.014551 -0.013796 -0.022322 -0.179916 -0.111855 -0.008195 -0.008674 -0.005193 -0.008231 0.009468 -0.015535
polarizability: 3.29225862e+02 -2.56732980e+01 3.00536818e+02 -3.91843775e+01 -7.97976922e+00 2.77899992e+02
1716.lowfreq: -14.6960 -5.8300 -0.8737 -0.0009 -0.0003 0.0004 15.6105 20.7610 26.4649
frequency: 11.4226 20.4323 26.2517 35.6148 41.3085 53.3819 56.1860 61.0809 69.3148 70.3765 76.9163 108.5099 161.0567 168.1526 170.9579 198.5461 203.8630 224.4931 233.5833 238.0569 252.1387 290.2236 310.2890 328.3246 346.2487 392.3837 395.8693 398.8595 405.6071 409.0440 427.8541 453.8166 461.8606 498.8254 510.6263 521.1144 560.1758 612.8334 614.7810 615.8939 616.0863 619.1512 663.3466 690.1519 692.4200 703.1881 705.5202 708.7609 709.7438 711.5285 736.0888 747.8542 751.0789 754.4583 774.6815 839.7116 854.5835 864.1994 864.6421 868.0221 919.6245 929.5055 930.1163 933.7721 935.1151 955.9994 976.1869 978.9067 983.9491 985.0227 986.9325 987.4704 988.5267 989.3012 990.9586 996.4155 999.1994 999.7798 1000.6163 1022.2941 1023.1497 1023.5714 1026.7683 1072.8546 1074.8472 1077.7580 1080.9806 1093.7231 1097.7313 1101.0113 1163.3578 1171.5581 1172.2811 1172.8230 1173.1904 1180.0606 1185.6650 1196.8720 1198.5863 1201.1543 1207.1024 1274.2320 1308.3413 1312.6469 1314.7300 1331.6442 1346.2656 1362.7458 1364.3013 1365.5453 1387.3909 1405.8776 1416.9387 1418.8642 1420.6842 1442.0352 1470.2828 1470.8322 1471.3070 1480.3810 1574.4523 1576.1807 1577.2292 1593.4875 1595.4250 1596.5417 1597.4676 1605.8340 1610.4588 2951.4693 3084.7948 3111.5855 3112.4430 3115.5503 3118.0624 3118.4420 3118.8237 3120.4067 3125.0506 3129.5419 3130.1055 3132.0465 3137.1864 3140.7255 3141.0672 3141.6894 3147.5089 3157.8756 3157.9935 3158.5357 3163.0808 3190.3619 3563.2795
redmass: 4.2400 4.7413 5.1016 4.6318 5.0744 4.9867 4.6754 4.5128 3.9183 4.4948 5.5194 3.9199 5.0537 4.7595 4.5229 4.7912 4.8185 5.6368 5.0300 4.7719 4.5239 1.3850 4.0134 2.5206 4.3423 2.7801 2.8142 2.8392 3.0562 5.6217 5.2471 4.4791 4.0344 5.6341 4.9300 5.3019 4.1117 4.7039 6.4312 6.4299 6.3007 5.1363 5.0755 5.1426 4.0866 2.1225 1.9255 1.9198 1.7971 1.8953 2.2240 1.6313 1.8258 1.8544 1.9869 2.8294 1.2460 1.2438 1.2451 1.2426 1.5863 1.4533 1.3541 1.5028 1.9498 3.2387 1.3842 1.4029 1.4832 1.3920 2.1930 5.3768 4.5647 2.5054 5.4966 1.3207 1.3072 1.3073 1.3070 3.2237 3.0959 3.0354 2.2038 1.7327 1.7140 1.7080 1.5999 2.6146 2.7028 2.7640 2.1794 1.0812 1.0575 1.0593 1.0566 1.6776 1.1346 1.1298 1.1324 1.1339 1.3927 1.3911 1.4938 1.4574 1.4539 1.2456 1.4514 4.1444 4.5667 4.8388 6.8116 1.2268 2.1332 2.1324 2.1335 2.1566 2.0177 2.0017 2.0051 2.2569 5.4264 5.4974 5.5596 6.0701 5.7297 5.7697 5.7949 4.9806 5.8981 1.0838 1.0599 1.0863 1.0861 1.0845 1.0860 1.0863 1.0863 1.0869 1.0869 1.0913 1.0915 1.0918 1.0917 1.0958 1.0959 1.0960 1.0960 1.1015 1.1015 1.1015 1.1014 1.1145 1.0661
irintensity: 0.0138 0.1216 0.0508 0.0427 0.0712 0.0533 0.0070 0.0991 0.1251 0.1852 0.0925 0.2280 0.7978 0.3653 0.4811 0.6639 2.6271 1.0625 1.3279 3.3507 2.1946 104.1989 3.7909 30.8216 3.9538 0.1573 0.1161 0.2653 0.2768 2.1683 6.0447 6.1119 2.9697 42.4732 129.2326 81.3823 11.8676 11.6146 0.4479 0.1998 1.5388 12.1298 6.0881 13.5842 13.9097 85.0845 73.0527 10.7192 61.9340 40.2119 4.5291 5.6034 37.4064 38.7389 41.0302 14.8761 0.2699 0.3344 0.5422 0.1941 46.5909 2.6154 1.0497 0.2336 0.8603 86.5298 37.1778 1.6632 0.2006 1.4184 1.8700 2.3655 1.2489 0.2401 1.4100 0.0504 0.0253 0.0889 0.0195 0.8225 2.8224 2.6006 5.5996 1.6503 0.4166 2.2871 7.3684 16.5662 36.5264 38.9864 6.4117 0.6524 0.5049 0.2454 0.2865 19.0911 0.5267 5.9887 3.5379 3.7504 29.3867 18.8295 4.6542 1.9695 5.9955 1.6458 12.2972 1.7522 1.2316 2.0831 1.4192 24.4838 14.0699 8.0538 24.6160 11.1593 4.3509 12.3409 9.3437 10.2420 0.6880 0.2010 0.3123 0.6161 0.1284 0.1465 0.1118 0.3704 1.0205 29.4198 7.3007 5.9957 4.3235 1.3485 0.4767 1.9726 3.7481 0.2294 0.5413 6.9859 9.1083 8.3337 19.8189 22.1918 38.0194 45.2090 29.8400 52.1358 50.1687 15.2127 24.6077 7.5374 6.0167
temp: 298.150 k
press: 1.00000 atm
elementType: 14 8 6 6 6 6 6 6 6 6 6 6 6 6 6 6 6 6 6 6 6 6 6 6 6 6 6 6 6 1 1 1 1 1 1 1 1 1 1 1 1 1 1 1 1 1 1 1 1 1 1 1 1
symmnumber: 1
zpe: 1108076.8 jmol-1
zpe.correction: 0.422044 hartree
zpe.thermalcorrener: 0.448528 hartree
zpe.thermalcorrenthalpy: 0.449472 hartree
zpe.thermalcorrgfe: 0.361852 hartree
zpe.sumelectzpe: -1405.861773 hartree
zpe.sumelectthermal: -1405.835289 hartree
zpe.sumelectthermalent: -1405.834345 hartree
zpe.sumelectthermalfe: -1405.921965 hartree
dipole: -1.3438 -0.0346 1.4519
dipole: 1.9787
quadrupole: -159.8827 -163.5493 -173.8960
quadrupole: -2.4783 -3.3072 -1.9997
quadrupole: 5.8933 2.2267 -8.1200 -2.4783 -3.3072 -1.9997
hfenergy: -1406.2838168 hartree
pointgroup: C01 [X(C27H24O1Si1)]
dipole: 0.166871 0.6862735 -0.3273966 debye
polarizability: 271.067222|43.3899451|335.0465043|-1.1140945|3.4388112|301.5489454 unknown
InChI: InChI=1S/C27H24OSi/c1-22(27(28)23-14-6-2-7-15-23)29(24-16-8-3-9-17-24,25-18-10-4-11-19-25)26-20-12-5-13-21-26/h2-21,27-28H,1H2
charge 0 multiplicity 1
53 atoms
Si -0.54266 -0.540578 0.181348
O  3.374164 -2.151582 0.230152
C  1.123661 -1.347783 0.70404
C  -0.794151 1.159549 1.022954
C  -0.606965 -0.308333 -1.724618
C  -1.963414 -1.720244 0.702126
C  2.364101 -1.138618 -0.164241
C  -1.736687 2.092237 0.504952
C  -0.152458 0.891666 -2.340057
C  -3.194683 -1.206946 1.19423
C  -0.105907 1.499127 2.218473
C  -1.095982 -1.345344 -2.566894
C  -1.840423 -3.130586 0.551713
C  2.96956 0.266048 -0.048391
C  1.185259 -2.120472 1.823824
C  -1.984352 3.320126 1.160047
C  -0.180689 1.048133 -3.744926
C  -4.26691 -2.068884 1.52141
C  -0.349712 2.72553 2.877627
C  -1.121331 -1.195876 -3.972731
C  -2.9097 -3.996216 0.876242
C  3.164594 1.060695 -1.204116
C  3.407889 0.75549 1.209071
C  -1.291213 3.639464 2.35076
C  -0.662363 0.002654 -4.566604
C  -4.128477 -3.46671 1.360373
C  3.782164 2.329318 -1.107521
C  4.027265 2.019099 1.306891
C  4.214167 2.811927 0.148348
H  2.083733 -1.306247 -1.226995
H  -2.277566 1.863352 -0.422288
H  0.222159 1.713992 -1.718495
H  -3.315958 -0.126244 1.336154
H  0.630668 0.801528 2.634988
H  -1.478792 -2.272526 -2.123454
H  -0.894376 -3.559693 0.198343
H  2.120691 -2.615398 2.110678
H  0.301376 -2.299143 2.448253
H  -2.713815 4.023783 0.742449
H  0.168404 1.984697 -4.195501
H  -5.205111 -1.650339 1.90384
H  0.195299 2.968097 3.797275
H  -1.504548 -2.008527 -4.60064
H  -2.790123 -5.079158 0.755367
H  4.241596 -1.890707 -0.171264
H  2.832412 0.685751 -2.180091
H  3.261741 0.136017 2.101172
H  -1.480857 4.591255 2.860462
H  -0.686144 0.122773 -5.655945
H  -4.958298 -4.136295 1.614758
H  3.927345 2.936053 -2.008459
H  4.362081 2.389903 2.282435
H  4.692032 3.795083 0.225678
