program: Gaussian 09
title: 000298615
version: EM64L-G09RevD.01
frameworkgroup: C1[X(C9H10O4)]
method: RPBEPBE
basis: SDD
operation: Freq
keyword: #pfreq=noraman
keyword: PBEPBE/SDD
title: #p freq=noraman PBEPBE/SDD
converged: NO YES NO NO
title: Mulliken charges:
elementType: O O O O C C C C C C C C C H H H H H H H H H H
charge: -0.249669 -0.274036 -0.254648 -0.196458 0.062714 0.290128 -0.370366 0.261112 0.167193 -0.754097 -0.220114 -0.670912 -0.189196 0.306881 0.260954 0.260905 0.243596 0.230960 0.230952 0.214192 0.232251 0.232251 0.185407
chargesum: 0.00000
title: Mulliken charges with hydrogens summed into heavy atoms:
elementType: O O O O C C C C C C C C C
charge: -0.249669 -0.274036 -0.254648 -0.196458 0.062714 0.290128 -0.063485 0.261112 0.167193 0.011357 0.241797 0.007782 -0.003789
polarizability: 1.57107979e+02 -1.41295606e+01 1.36920635e+02 6.57252932e-03 5.51059479e-03 5.90464549e+01
1716.lowfreq: -82.6719 -8.6856 -5.6645 -4.8745 0.0002 0.0006 0.0007 29.6583 72.0902
frequency: -82.6712 29.3114 72.0849 72.4373 86.7841 125.9838 159.0024 179.2403 207.0982 245.7015 258.7188 290.1741 319.7413 352.1062 364.9254 463.7479 516.6366 610.9337 620.0790 676.1597 740.0944 749.3591 797.8280 798.5058 826.7187 897.8420 918.1869 959.1563 974.2553 1015.5658 1035.2497 1049.6106 1112.1894 1134.5582 1138.8657 1156.1198 1225.2135 1248.1839 1248.8663 1349.8964 1378.2301 1398.1397 1402.2358 1414.7379 1443.7253 1459.4520 1462.7075 1473.3786 1486.1109 1534.9917 1581.0762 1594.7782 1618.7813 2917.1212 2997.5289 2999.8859 3011.2175 3070.3222 3078.2257 3093.9521 3110.3890 3119.6852 3252.5835
redmass: 1.0172 2.6206 5.4634 4.8408 3.2866 4.1652 5.8203 2.5095 3.5420 1.3337 3.1947 4.8867 4.5114 4.1943 5.1188 6.6180 4.8488 4.3845 6.2425 5.8381 6.2608 5.6985 4.8731 1.1037 3.9787 1.3881 4.4073 2.3167 1.7337 2.2502 1.4848 5.1700 2.2200 1.4631 1.9636 2.8912 4.9415 1.1358 5.3464 1.4730 1.4728 1.3364 1.3358 2.5289 1.0434 1.1404 1.0402 1.0637 1.0710 10.4350 7.8662 6.4051 11.3558 1.0851 1.0359 1.0369 1.0581 1.1068 1.0963 1.0985 1.1026 1.1006 1.0992
irintensity: 0.2859 0.8767 3.9987 2.0622 0.3566 4.0010 4.9361 0.0000 3.7559 0.1656 21.1872 3.1348 4.6594 9.5357 8.5883 8.0036 8.3980 0.6290 1.0619 34.0378 15.5555 14.7984 10.8407 3.0667 0.3528 17.9066 5.7952 40.8326 4.6605 3.3777 7.6463 322.1417 3.4396 5.9257 171.8186 20.9251 235.8051 0.0187 2.0091 6.5880 27.1601 47.7931 6.1301 13.2483 18.4064 12.8924 12.6947 5.6487 14.5974 224.9456 143.3006 308.7767 132.0190 93.3677 19.2248 2.6677 19.1385 8.3914 3.8326 28.3318 41.8986 8.8510 4.4545
temp: 298.150 k
press: 1.00000 atm
elementType: 8 8 8 8 6 6 6 6 6 6 6 6 6 1 1 1 1 1 1 1 1 1 1
symmnumber: 1
zpe: 454140.7 jmol-1
zpe.correction: 0.172973 hartree
zpe.thermalcorrener: 0.185788 hartree
zpe.thermalcorrenthalpy: 0.186733 hartree
zpe.thermalcorrgfe: 0.132288 hartree
zpe.sumelectzpe: -648.868580 hartree
zpe.sumelectthermal: -648.855765 hartree
zpe.sumelectthermalent: -648.854821 hartree
zpe.sumelectthermalfe: -648.909266 hartree
dipole: -2.5147 2.1801 0.0006
dipole: 3.3281
quadrupole: -72.4861 -82.5285 -74.6750
quadrupole: 17.9985 0.0009 0.0002
quadrupole: 4.0771 -5.9653 1.8882 17.9985 0.0009 0.0002
hfenergy: -649.0415535 hartree
pointgroup: C01 [X(C9H10O4)]
dipole: 1.0243742 0.8155798 -0.0002459 debye
dipolederiv: -0.6916118 0.1514654 -0.0000914 0.0652992 -0.3050192 -0.000002 -0.0001627 0.0000566 -0.1270037 -1.3558848 0.512355 0.0000527 0.8356778 -0.9696971 0.0000182 0.0002529 -0.0002145 -0.2788565 -0.844278 -0.2389679 -0.0001425 -0.0479435 -0.8931533 -0.0001701 0.0000213 0.0001532 -0.3127912 -0.5963914 -0.139392 -0.0000238 -0.6730177 -1.0570199 -0.0000745 0.0001302 0.0002144 -0.3341826 -0.7380794 0.1583441 -0.0000881 -0.1499447 -0.5778036 0.0000213 -0.0002084 0.0001114 -0.0609668 0.4088803 -0.269139 0.0001213 -0.1772889 0.7610835 -0.0001207 0.0000225 -0.000414 0.0751476 0.4277483 0.3243069 0.0000631 0.2389303 0.1247691 0.0000106 0.0000168 0.0000481 -0.0887375 -1.0108957 -0.7336556 -0.0000457 -0.1367113 0.040337 0.0000249 -0.000146 -0.000137 0.0024614 2.0025997 -0.1109578 0.0001941 -0.635068 1.4639698 0.0001307 0.0001817 -0.0000293 0.243502 0.0228111 -0.1672851 -0.0000671 -0.049811 -0.2995463 0.0000257 -0.0000874 0.0004395 0.0086521 0.9574958 -0.3081552 -0.0000578 -0.2111487 0.3370719 0.0000067 -0.0001017 0.0000567 0.3536334 -0.0409714 0.0894208 0.0000077 0.070525 -0.080411 -0.0000383 0.0000208 -0.0000399 0.0589074 1.4339756 0.5038061 0.0000826 0.7015573 1.1686624 0.0000341 -0.0000048 -0.0001268 0.132679 0.1531417 0.0182909 -0.0000103 0.0187213 0.068603 0.0000086 -0.0000058 0.0000093 0.1769386 0.0848602 -0.0012199 -0.0840847 -0.0125268 0.0470653 -0.0116849 -0.0719759 -0.0426747 0.0079693 0.0850398 -0.0011678 0.0839771 -0.0125044 0.0468467 0.011765 0.0718859 0.042674 0.0076324 -0.0553624 0.1186748 0.0001724 0.0310773 0.0529357 -0.0000344 0.0001456 -0.0001718 0.1334725 -0.0671221 0.0511033 0.0172272 -0.0297214 -0.0000324 0.0920822 0.0568325 0.0828969 -0.0574604 -0.0671575 0.05108 -0.0172411 -0.029738 0.0000272 -0.0920631 -0.0568583 -0.0828997 -0.0575124 -0.1760418 0.03354 0.0000389 0.0162806 0.0708892 -0.0000035 0.000047 -0.0000119 0.1175469 0.1061796 -0.0638309 0.0768727 -0.0072037 0.0227355 0.0744099 0.0558551 0.095108 -0.0602804 0.1061423 -0.0638331 -0.0769297 -0.0072107 0.0227956 -0.0743786 -0.0559109 -0.0950577 -0.0603017 -0.1450782 0.0852169 -0.0000278 0.2017703 -0.0451092 0.0000323 0.0000498 0.0000092 0.1195506 unknown
polarizability: 158.2539627|13.2361942|135.7746509|0.0063362|-0.0057808|59.0464549 unknown
InChI: InChI=1S/C9H10O4/c1-3-12-9(11)8-4-7(5-10)13-6(8)2/h4-5H,3H2,1-2H3
charge 0 multiplicity 1
23 atoms
O  -2.207387 0.97884 -0.000003
O  2.105795 -0.658706 0.000575
O  2.075594 1.680671 0.000526
O  -3.430309 -2.454464 0.000372
C  0.000244 0.419271 0.000493
C  -0.91241 1.489407 0.000206
C  -0.760912 -0.801726 0.000397
C  -2.106903 -0.449744 0.00011
C  1.46326 0.579981 0.000859
C  -0.754932 2.970974 0.000063
C  3.601971 -0.619301 0.000364
C  4.07917 -2.067438 0.000046
C  -3.360451 -1.191771 -0.000067
H  -0.362367 -1.812782 0.000555
H  -0.178021 3.301339 0.881786
H  -0.179649 3.301393 -0.882723
H  -1.74157 3.460655 0.000917
H  3.932756 -0.061537 -0.89438
H  3.933003 -0.061848 0.895211
H  5.184079 -2.094917 -0.000119
H  3.719103 -2.602381 0.895085
H  3.718843 -2.602072 -0.895073
H  -4.274009 -0.550345 0.0000
