program: Gaussian 09
title: 000298610
version: EM64L-G09RevD.01
frameworkgroup: C1[X(C7H9NO2S)]
method: RPBEPBE
basis: SDD
operation: Freq
keyword: #p
keyword: freq=noraman
keyword: PBEPBE/SDD
title: #p freq=noraman PBEPBE/SDD
converged: NO YES NO NO
title: Mulliken charges:
elementType: S O O N C C C C C C C H H H H H H H H H
charge: 0.339910 -0.284246 -0.251937 -0.010875 -0.491766 0.333025 -0.256351 0.303955 -0.755380 -0.664000 -0.458842 0.239362 0.223104 0.274147 0.243892 0.242548 0.219963 0.226088 0.254130 0.273271
chargesum: 0.00000
title: Mulliken charges with hydrogens summed into heavy atoms:
elementType: S O O N C C C C C C C
charge: 0.339910 -0.284246 -0.251937 -0.010875 -0.491766 0.333025 0.206115 0.303955 0.005207 0.036182 -0.185571
polarizability: 1.41424696e+02 -1.29922074e+00 1.15012858e+02 -5.02060563e+00 -2.16345960e-02 5.81498809e+01
1716.lowfreq: -34.3171 -12.8898 -2.3062 0.0018 0.0028 0.0031 7.2376 37.3501 59.0592
frequency: -33.9604 37.2498 58.9912 89.9461 144.0998 152.6131 223.1474 250.2698 289.2193 304.0199 330.7961 428.6538 458.1723 475.4660 552.9991 636.1432 640.8806 715.8028 726.4294 772.3549 786.5238 797.9291 814.8744 916.6975 964.1197 1019.5332 1044.9390 1049.9348 1095.5881 1154.2485 1197.1658 1249.6693 1278.1371 1315.5407 1357.1158 1391.5663 1392.7395 1418.3404 1443.6645 1455.0979 1464.0168 1468.5713 1484.6011 1519.9300 1603.9961 2994.1548 2994.5742 3032.2140 3073.6683 3088.4006 3096.5374 3121.5360 3153.2601 3217.3933
redmass: 1.0863 2.9175 4.4579 4.6965 3.1595 4.6683 1.2808 4.2868 7.1652 2.7338 3.4322 3.4452 8.2276 5.2557 5.6842 8.6321 5.6298 8.3320 3.4615 6.0008 1.2805 3.1575 1.4804 3.1769 3.0893 3.1182 1.5994 2.5990 2.1605 1.6598 2.3433 1.7829 1.1169 3.8849 1.4386 1.2359 1.2431 7.8494 1.2585 1.1013 1.0439 1.0676 1.0527 3.6355 9.9740 1.0364 1.0408 1.0591 1.0947 1.0976 1.1035 1.1059 1.0976 1.0954
irintensity: 0.4138 0.1001 1.9677 0.1669 1.6575 3.5408 2.8971 3.4491 3.8870 3.8278 20.9988 2.2478 1.1782 5.2882 2.8181 7.0522 0.9922 7.9214 2.3454 9.0021 37.1805 15.9212 2.9789 6.4290 52.0402 108.9354 33.6150 151.9092 16.9950 26.3182 75.0623 47.3025 5.3127 157.5203 19.4614 35.6253 29.5004 31.4790 23.4868 23.7739 17.8809 18.1007 14.5171 15.8990 261.7893 20.1453 10.3403 31.3571 11.8459 34.6249 1.7873 27.3941 2.2066 0.2481
temp: 298.150 k
press: 1.00000 atm
elementType: 16 8 8 7 6 6 6 6 6 6 6 1 1 1 1 1 1 1 1 1
symmnumber: 1
zpe: 393233.7 jmol-1
zpe.correction: 0.149775 hartree
zpe.thermalcorrener: 0.160712 hartree
zpe.thermalcorrenthalpy: 0.161656 hartree
zpe.thermalcorrgfe: 0.111848 hartree
zpe.sumelectzpe: -874.566448 hartree
zpe.sumelectthermal: -874.555512 hartree
zpe.sumelectthermalent: -874.554567 hartree
zpe.sumelectthermalfe: -874.604375 hartree
dipole: 1.3148 1.4319 0.0513
dipole: 1.9446
quadrupole: -60.0857 -76.6651 -72.0406
quadrupole: 8.0070 -0.7095 -1.1543
quadrupole: 9.5114 -7.0680 -2.4435 8.0070 -0.7095 -1.1543
hfenergy: -874.7162231 hartree
pointgroup: C01 [X(C7H9N1O2S1)]
dipole: 0.4886378 -0.5330422 0.2498956 debye
dipolederiv: -0.012691 -0.1271658 0.0224538 -0.1386706 -0.2940347 0.1971878 0.0358148 0.1978018 0.0882495 -1.5323616 0.2338851 -0.1628901 0.460365 -0.5536997 0.164741 -0.4054681 0.1625006 -0.4353738 -0.7982373 -0.2224649 0.0407112 -0.0915643 -0.8112168 0.1887122 -0.031577 0.1872659 -0.4004488 -0.4739415 0.2127143 -0.1398706 0.0226918 -0.6413131 0.2038521 -0.0578964 0.2430356 -0.3159714 -0.7149973 -0.3454955 0.0945104 -0.4590111 -0.0900187 -0.1082188 0.1226771 -0.0979513 -0.1231091 0.3725998 -0.1559451 0.1199778 0.1817031 0.4082106 -0.1460098 -0.0432324 -0.2231696 0.1867499 0.9968442 -0.0937387 0.0298789 0.0418561 0.225291 0.0494332 0.0257268 0.000076 0.3354724 2.0082067 0.1789708 0.1424625 -0.2170683 1.0761566 -0.3533687 0.4016366 -0.3487159 0.4740914 -0.0033875 -0.0438195 0.0151022 0.0316007 -0.1687014 0.1204373 0.0018609 0.1683412 -0.0311221 -0.1447195 0.0386568 0.0469127 -0.0005345 0.0436335 -0.0485573 0.0560924 -0.0125564 -0.1175031 0.1302151 0.2103251 -0.0374926 0.2047374 0.5699316 -0.2987341 -0.0444569 -0.3013039 -0.0335046 -0.0161677 0.0348068 0.0078008 -0.0742534 -0.070359 -0.095233 0.0337421 -0.0297296 0.0630183 -0.0336057 0.0247944 -0.024325 0.049522 0.0512498 0.1093868 -0.0492629 0.0701014 -0.0780181 -0.019748 0.0737727 -0.0184063 0.0177079 0.1223137 0.0011233 0.0035452 -0.0088433 0.1166275 0.101156 0.0392599 0.0566232 0.0199705 0.0709372 0.0076843 0.0502726 0.0390208 -0.0840985 0.0844728 -0.0447588 -0.0633578 -0.0334712 -0.0506265 -0.0423416 -0.0535616 -0.0858403 0.0669519 -0.1940905 -0.0258594 -0.0218916 -0.0254663 0.1077347 -0.0148368 0.0004608 -0.0247186 0.0980328 0.1171399 -0.0590723 0.0009944 -0.0116812 -0.1222041 -0.0671006 0.0198285 -0.0333074 0.0616394 0.1195677 0.0505031 -0.0702918 0.0378045 0.0346007 0.0919313 -0.042214 0.0531729 -0.0313256 0.0137454 0.020631 -0.038902 -0.0162381 0.0921148 0.0399113 -0.0239883 0.0448202 0.159642 unknown
polarizability: 140.8631889|3.6714425|104.760617|7.9602546|-21.6472094|68.963629 unknown
InChI: InChI=1S/C7H9NO2S/c1-3-10-7(9)6-5(2)8-4-11-6/h4H,3H2,1-2H3
charge 0 multiplicity 1
20 atoms
S  -1.727282 1.383413 -0.947094
O  1.635263 -0.374058 0.484418
O  1.271045 1.672949 -0.584292
N  -2.66189 -0.939304 -0.034083
C  -0.590019 0.183734 -0.196043
C  -1.275494 -0.967539 0.217982
C  3.095278 -0.043707 0.558618
C  0.825511 0.583459 -0.13674
C  -0.722065 -2.195189 0.887861
C  3.812445 -0.439536 -0.734805
C  -3.039636 0.185955 -0.619846
H  3.198498 1.036278 0.76182
H  3.443438 -0.630672 1.423669
H  0.374598 -2.209715 0.862349
H  -1.053201 -2.226278 1.942985
H  -1.131103 -3.09454 0.395682
H  4.900036 -0.276816 -0.617819
H  3.647058 -1.50547 -0.968216
H  3.461461 0.173337 -1.581123
H  -4.067842 0.413601 -0.901824
