program: Gaussian 09
title: 000298650
version: EM64L-G09RevD.01
frameworkgroup: C1[X(C22H17NO)]
method: RPBEPBE
basis: SDD
operation: Freq
keyword: #p
keyword: freq=noraman
keyword: PBEPBE/SDD
title: #p freq=noraman PBEPBE/SDD
converged: YES YES NO NO
title: Mulliken charges:
elementType: O N C C C C C C C C C C C C C C C C C C C C C C H H H H H H H H H H H H H H H H H
charge: -0.231550 -0.608115 -0.553708 0.141170 0.335298 0.095321 0.136224 0.291431 0.311402 -0.437706 0.209505 -0.391392 -0.240291 -0.247541 -0.399891 -0.404025 -0.387053 -0.432914 -0.249665 -0.231872 -0.227078 -0.239923 -0.248773 -0.246559 0.257313 0.240553 0.264257 0.225020 0.225709 0.260342 0.254599 0.261682 0.255394 0.332828 0.319654 0.224197 0.226467 0.227831 0.225704 0.227788 0.228365
chargesum: 0.00000
title: Mulliken charges with hydrogens summed into heavy atoms:
elementType: O N C C C C C C C C C C C C C C C C C C C C C C
charge: -0.231550 0.044368 -0.296395 0.141170 0.335298 0.095321 0.136224 0.291431 0.311402 -0.197153 0.209505 -0.127134 -0.015271 -0.021832 -0.139549 -0.149426 -0.125371 -0.177520 -0.025468 -0.005405 0.000753 -0.014219 -0.020985 -0.018194
polarizability: 3.14928815e+02 -1.81158998e+01 3.05694872e+02 9.14369696e+00 -1.10679067e+01 1.48021749e+02
1716.lowfreq: -9.5200 -7.6267 -4.0707 -0.0005 -0.0004 0.0002 26.5512 37.4523 43.9965
frequency: 26.5343 37.3734 43.9855 55.2533 62.4739 65.7158 91.0421 102.0022 119.6666 188.6131 197.0885 224.6607 249.5626 272.8311 289.0056 298.3382 376.7012 392.1683 402.7365 406.2073 429.6849 475.6681 491.0428 508.8773 514.3570 539.6189 576.6757 592.9676 611.1884 613.6475 620.1087 632.8028 653.9963 674.4028 700.0440 704.5922 710.1323 739.2867 743.1706 762.4604 768.6635 793.3632 826.6753 849.4674 853.2555 859.2716 883.3640 901.4847 926.0228 929.2136 945.6836 952.8331 978.7487 981.1105 986.0026 987.8903 989.2430 995.0145 996.9229 1019.1992 1025.9033 1029.4302 1049.9979 1057.0178 1081.7663 1085.9510 1101.8992 1151.3757 1169.8096 1172.4358 1172.6849 1178.4193 1191.4379 1197.6939 1198.7195 1209.3760 1256.9137 1290.5478 1312.1184 1317.5097 1322.2567 1352.1423 1369.4004 1371.3390 1401.7597 1431.5400 1433.7586 1446.6368 1460.8276 1476.6699 1488.5933 1570.1036 1578.5838 1586.0222 1593.6243 1597.6492 1607.9707 1612.4023 1614.4630 1646.2642 2975.7522 3121.5835 3122.0263 3122.7814 3130.1153 3132.5442 3133.1184 3142.3523 3147.9918 3148.9966 3152.6524 3160.5150 3162.8789 3165.5893 3171.8699 3513.7372 3669.7253
redmass: 5.1814 4.2360 4.8340 4.5881 4.1850 5.1723 4.6964 5.1026 6.3064 5.2174 4.7503 5.2633 4.8524 5.7550 4.6393 5.3701 4.3533 4.2936 2.8907 2.8767 3.0939 3.9442 1.5546 2.4713 2.8599 3.1854 3.7369 3.5724 6.0340 5.8504 2.6806 3.2461 5.0250 5.7955 1.9162 1.8799 3.2802 2.3820 2.9669 1.6862 1.9439 2.9462 4.8164 2.6345 1.2757 1.2663 1.6766 4.2596 1.4479 1.4798 1.4333 5.0855 1.4916 1.3622 1.3857 4.5024 4.2921 1.3967 1.3178 2.8375 2.2292 2.1341 2.0598 2.2208 1.6562 1.7374 1.8765 1.4019 1.1941 1.0620 1.0596 1.9908 1.1439 1.3983 1.8400 1.5370 2.4614 2.1035 2.7655 1.5080 1.5142 3.1994 5.7418 5.6538 6.0139 2.3435 2.3102 2.4393 3.0979 2.2464 2.5316 6.2748 5.8503 6.8737 1.6211 4.4253 5.7649 6.3689 6.3768 4.0709 1.0823 1.0857 1.0853 1.0846 1.0878 1.0891 1.0888 1.0929 1.0938 1.0937 1.0962 1.0972 1.1000 1.1013 1.0972 1.0447 1.1044
irintensity: 1.0195 0.8029 9.7831 0.5860 0.1193 2.9100 0.5657 0.8328 2.1405 1.4095 0.5339 0.9203 1.0790 0.3856 1.6589 0.8306 0.7090 1.1496 0.0208 0.1110 3.1414 2.5989 69.9643 24.6605 44.3360 17.9861 24.8445 58.2057 1.6341 3.0714 17.2599 17.8690 0.8858 2.3068 50.7809 25.4777 29.4799 49.7811 25.7229 34.5751 44.7364 24.7823 3.8875 1.5165 0.4448 0.3103 0.9666 0.9353 2.5664 2.2376 0.5041 6.6771 0.8960 0.6090 0.1751 0.1529 0.2561 0.2783 0.2708 0.8770 17.7859 5.7627 2.3016 3.3483 4.2547 12.4367 3.0398 6.5329 1.2182 0.1340 0.0727 0.7074 1.3381 3.1664 2.9938 29.3553 9.4015 17.6580 187.3154 4.7798 20.2167 16.0777 0.1113 0.6373 5.8365 6.6236 10.6771 4.5203 27.4854 21.1493 8.4550 0.1818 5.1784 1.3522 68.1326 9.7881 3.9264 10.2469 7.5370 222.2811 20.4145 5.6858 0.3650 1.0477 1.8328 11.8173 10.0484 31.7300 14.3568 32.2366 29.6745 24.5539 36.3075 19.2940 12.6424 42.9468 24.0720
temp: 298.150 k
press: 1.00000 atm
elementType: 8 7 6 6 6 6 6 6 6 6 6 6 6 6 6 6 6 6 6 6 6 6 6 6 1 1 1 1 1 1 1 1 1 1 1 1 1 1 1 1 1
symmnumber: 1
zpe: 849392.6 jmol-1
zpe.correction: 0.323517 hartree
zpe.thermalcorrener: 0.343030 hartree
zpe.thermalcorrenthalpy: 0.343974 hartree
zpe.thermalcorrgfe: 0.273955 hartree
zpe.sumelectzpe: -976.906919 hartree
zpe.sumelectthermal: -976.887406 hartree
zpe.sumelectthermalent: -976.886462 hartree
zpe.sumelectthermalfe: -976.956481 hartree
dipole: -0.9464 -1.4679 -3.1005
dipole: 3.5585
quadrupole: -119.4438 -115.2219 -146.1946
quadrupole: 10.0156 6.6405 2.3951
quadrupole: 7.5096 11.7316 -19.2412 10.0156 6.6405 2.3951
hfenergy: -977.230436 hartree
pointgroup: C01 [X(C22H17N1O1)]
dipole: 0.2742319 -0.7789747 1.1305238 debye
polarizability: 318.7626316|14.224423|295.8768108|15.8361899|30.2634069|154.0059927 unknown
InChI: InChI=1S/C22H17NO/c23-22(24)21-18-14-8-7-13-17(18)19(15-9-3-1-4-10-15)20(21)16-11-5-2-6-12-16/h1-14,21H,23H2
charge 0 multiplicity 1
41 atoms
O  1.339806 -2.065661 -2.213508
N  2.178585 -3.614102 -0.707382
C  1.241713 -1.524374 0.21281
C  -0.056615 -0.710961 0.115588
C  2.316378 -0.450239 0.378577
C  0.23055 0.64524 0.18284
C  1.692043 0.829508 0.340628
C  -1.389248 -1.359486 0.112635
C  -0.728029 1.774724 0.069206
C  3.707401 -0.578781 0.504066
C  1.566057 -2.40865 -1.020451
C  2.476346 2.002054 0.424055
C  4.492108 0.599129 0.609326
C  3.879026 1.875024 0.564752
C  -1.66204 -2.510781 -0.681058
C  -2.430105 -0.863148 0.951637
C  -1.669081 1.815739 -0.996058
C  -0.710414 2.847834 1.002489
C  -2.927081 -3.136162 -0.63887
C  -3.692011 -1.489653 0.993007
C  -2.572256 2.892189 -1.117779
C  -1.61979 3.922055 0.884125
C  -3.948942 -2.631844 0.197928
C  -2.554153 3.949463 -0.177184
H  1.192791 -2.17579 1.109692
H  4.188332 -1.563849 0.509176
H  2.011888 2.991603 0.365113
H  5.580035 0.522036 0.713828
H  4.500767 2.774986 0.631427
H  -0.899688 -2.888791 -1.368192
H  -2.236642 0.010694 1.582264
H  -1.676938 1.003141 -1.730058
H  -0.000778 2.824534 1.83763
H  2.471323 -4.222675 -1.472146
H  2.322582 -3.918204 0.253646
H  -3.117006 -4.012569 -1.269034
H  -4.473331 -1.090848 1.649932
H  -3.287563 2.908852 -1.947696
H  -1.599441 4.734968 1.618911
H  -4.929777 -3.119416 0.23012
H  -3.256902 4.784912 -0.272088
