program: Gaussian 09
title: 000298608
version: EM64L-G09RevD.01
frameworkgroup: C1[X(C10H14OS)]
method: RPBEPBE
basis: SDD
operation: Freq
keyword: #p
keyword: freq=noraman
keyword: PBEPBE/SDD
title: #p freq=noraman PBEPBE/SDD
converged: NO YES NO NO
title: Mulliken charges:
elementType: S O C C C C C C C C C C H H H H H H H H H H H H H H
charge: 0.212019 -0.233474 -0.475629 0.373537 -0.363995 0.094877 -0.252139 -0.324976 -0.084767 -0.691377 -0.720130 -0.762210 0.226948 0.226902 0.218561 0.218579 0.259120 0.204965 0.223077 0.204968 0.213480 0.256559 0.256754 0.240505 0.240505 0.237342
chargesum: 0.00000
title: Mulliken charges with hydrogens summed into heavy atoms:
elementType: S O C C C C C C C C C C
charge: 0.212019 -0.233474 -0.021780 0.373537 0.073146 0.094877 -0.252139 -0.065856 -0.084767 -0.058369 0.006663 -0.043858
polarizability: 1.69691283e+02 -6.85895723e+00 1.42153489e+02 2.10907476e-02 2.24950624e-03 7.36792794e+01
1716.lowfreq: -25.8081 -0.0018 0.0022 0.0024 2.9877 6.1317 28.5941 41.7681 81.1207
frequency: 16.3797 41.4815 81.1108 91.7004 111.3922 114.9646 145.9778 153.9286 213.1328 232.0055 241.5563 293.0356 303.7572 351.9925 357.1739 455.5736 479.4464 484.0719 516.0283 626.3009 652.5731 655.0901 713.2472 738.6159 826.0337 845.9858 877.8794 896.3768 981.9826 991.5790 1018.6807 1044.1753 1052.2826 1082.5488 1102.5279 1137.8207 1138.8969 1181.2714 1215.1854 1215.3022 1278.6706 1282.5739 1343.6233 1362.5321 1385.0648 1402.0451 1403.2797 1434.7992 1444.1098 1454.2134 1458.9760 1467.7050 1471.5777 1477.7140 1482.7641 1503.3305 1568.4247 1594.3588 2954.9065 2968.3980 2976.4659 2988.0997 3001.7418 3004.8432 3044.3227 3054.2044 3070.9300 3071.7086 3074.6450 3085.2625 3091.1570 3176.2538
redmass: 2.0976 2.7650 2.0299 3.5431 1.2423 1.1414 3.7503 2.8926 3.6587 1.0791 2.9795 4.1154 3.7938 5.2756 3.8366 5.2393 4.1023 5.2588 2.8353 5.3084 5.6842 2.6510 5.5657 1.2394 3.8458 1.3415 1.4536 1.9456 2.0020 1.5843 1.4045 1.4113 2.4855 1.5559 2.3548 2.5470 2.5394 3.9909 1.3623 1.7454 1.6836 1.0886 1.8550 3.5764 1.2178 1.2330 1.1807 1.1081 1.0443 1.0777 1.0432 1.0620 1.1014 1.0433 1.0701 7.9107 7.1684 7.1716 1.0596 1.0359 1.0365 1.0358 1.0975 1.0611 1.0999 1.0983 1.0963 1.0986 1.1024 1.0985 1.1012 1.0942
irintensity: 0.1620 0.5308 1.3784 0.1971 0.5901 2.4924 2.9899 1.8302 2.3693 0.0794 0.3802 10.5848 0.1981 0.3059 1.0142 4.6734 10.7329 0.4766 2.8729 2.3364 13.8358 0.0591 11.2474 14.3678 20.0604 16.4331 2.4862 16.2224 4.2051 1.6418 2.8191 5.5033 1.2092 0.6251 13.9720 38.6469 19.0185 16.4014 1.4915 78.8322 28.5002 0.2303 1.9401 74.9791 5.9828 14.5902 10.3889 13.7465 13.8801 8.8529 15.6865 6.2490 20.1959 12.6400 13.7599 196.5648 62.4086 51.5740 24.8026 39.0682 36.8336 11.7767 9.4394 17.0579 1.6440 17.3785 4.8987 53.0380 80.5721 13.1589 17.0695 5.2521
temp: 298.150 k
press: 1.00000 atm
elementType: 16 8 6 6 6 6 6 6 6 6 6 6 1 1 1 1 1 1 1 1 1 1 1 1 1 1
symmnumber: 1
zpe: 556609.1 jmol-1
zpe.correction: 0.212001 hartree
zpe.thermalcorrener: 0.226185 hartree
zpe.thermalcorrenthalpy: 0.227130 hartree
zpe.thermalcorrgfe: 0.169241 hartree
zpe.sumelectzpe: -861.828960 hartree
zpe.sumelectthermal: -861.814776 hartree
zpe.sumelectthermalent: -861.813831 hartree
zpe.sumelectthermalfe: -861.871719 hartree
dipole: 1.3645 -2.8873 0.0024
dipole: 3.1935
quadrupole: -78.1260 -76.6201 -81.2278
quadrupole: 2.6278 -0.0052 0.0118
quadrupole: 0.5320 2.0379 -2.5699 2.6278 -0.0052 0.0118
hfenergy: -862.0409609 hartree
pointgroup: C01 [X(C10H14O1S1)]
dipole: 0.5822354 -1.1133838 0.0033022 debye
dipolederiv: -0.4292533 0.0771853 -0.00028 0.1630683 -0.2411632 0.0005129 -0.000331 0.0006072 0.0863508 -0.8804689 0.0650998 -0.0002791 0.4151022 -0.7797457 0.0016392 -0.0012062 0.0015522 -0.2871869 -0.2166954 -0.1451136 0.0004325 -0.3536237 -0.2684458 0.0013348 0.0008821 0.0011666 0.1614451 -1.161807 -0.0859392 -0.0000367 -0.2377565 -0.2156254 0.0004546 0.0002721 0.0005047 -0.0109825 0.1018201 0.0104556 -0.000024 -0.0368752 0.0703261 0.0001902 0.0001683 0.0002289 0.1375132 1.7917804 0.0710926 0.0000615 -0.159715 0.8847041 -0.0026169 0.0005552 -0.0024036 0.1099102 0.6905908 -0.1497726 0.000429 0.1797423 0.307621 -0.0007888 -0.0006644 -0.0014709 -0.1187467 -0.1456335 0.0255511 -0.0000942 -0.0906638 -0.0854722 -0.0002044 0.0004634 -0.0000617 -0.1640906 0.0813195 0.078132 0.000055 -0.0097053 0.4302857 -0.0010089 0.0001139 -0.0010633 -0.200881 -0.0406695 -0.0727618 0.0002795 -0.0277097 0.0284012 0.0003238 0.0001569 0.0003186 0.1065485 0.0825727 0.2089435 0.0000827 -0.0091685 -0.2022525 0.0004434 0.0008868 0.0012453 0.0311384 0.0027919 0.0130666 -0.0000663 0.04218 -0.064254 0.0003098 -0.0001695 0.0003104 0.1126292 0.0110824 0.0136098 -0.0508731 0.0545014 0.0169934 0.085909 -0.071921 0.0946632 -0.0373337 0.0111406 0.0139009 0.0508158 0.0548695 0.0159476 -0.0862468 0.0716477 -0.0949514 -0.036297 0.0369158 -0.0071397 -0.0172895 0.0314997 -0.0066612 0.105979 -0.0317338 0.1101251 -0.0651561 0.0370179 -0.0071201 0.0172604 0.0316918 -0.0080995 -0.1063608 0.0314296 -0.1104696 -0.0636814 0.0700154 -0.1091107 0.0001261 -0.0825631 -0.0161518 0.0003115 0.0000734 0.0002639 0.1684846 0.0869678 0.0369438 0.0604611 -0.020485 -0.0237031 -0.1128369 0.01643 -0.1360429 -0.0926984 -0.2368426 0.0199552 0.000062 0.0624731 0.0599177 0.000095 -0.0000373 0.0001204 0.1008439 0.0868959 0.0366982 -0.0608885 -0.0204498 -0.0220064 0.1123484 -0.016501 0.1355157 -0.0943048 -0.0974575 -0.1547509 -0.000591 -0.0420605 0.0497525 -0.0000615 -0.0007031 -0.0004676 0.1173942 0.058716 0.0243221 -0.0847984 0.0108464 0.026595 0.026288 -0.0603826 0.0485819 -0.0066068 0.0580394 0.0248847 0.0851968 0.0113566 0.026887 -0.0260861 0.0606465 -0.0483384 -0.0050474 -0.0077047 0.064615 0.1035776 0.032234 0.0524252 0.0225214 0.1320744 -0.0388408 -0.0350544 -0.0075252 0.0642271 -0.10377 0.0318226 0.0524697 -0.0227828 -0.1321596 0.0385963 -0.0353107 0.016391 -0.1169748 0.0001507 -0.0306119 -0.0887454 0.0003329 0.0000092 0.0003096 0.1211204 unknown
polarizability: 170.1994056|-5.726613|141.6450657|0.0268285|-0.1437885|73.679581 unknown
InChI: InChI=1S/C10H14OS/c1-4-5-10(11)9-6-7(2)12-8(9)3/h6H,4-5H2,1-3H3
charge 0 multiplicity 1
26 atoms
S  3.03671 0.491132 -0.000558
O  -1.469424 1.781882 -0.005935
C  -2.037836 -0.595018 0.001282
C  0.402283 0.257784 -0.001177
C  -3.515933 -0.163304 0.000284
C  -1.050133 0.581874 -0.002227
C  1.399475 1.246056 -0.002431
C  0.940227 -1.095207 0.001383
C  2.317513 -1.179835 0.002027
C  -4.47341 -1.374007 0.004831
C  1.275068 2.742342 -0.005142
C  3.209282 -2.389639 0.004437
H  -1.824087 -1.229253 0.887478
H  -1.824403 -1.234266 -0.881392
H  -3.706829 0.473956 -0.882924
H  -3.70623 0.480029 0.879213
H  0.311971 -1.9890 0.002675
H  -4.318486 -2.01178 -0.886573
H  -5.529311 -1.047277 0.004287
H  -4.317525 -2.005716 0.900373
H  2.262486 3.235552 -0.002219
H  0.703981 3.081747 -0.887801
H  0.697204 3.084262 0.872055
H  3.863538 -2.423378 -0.886882
H  3.862777 -2.420384 0.896424
H  2.593793 -3.306048 0.005712
