program: Gaussian 09
title: 000298641
version: EM64L-G09RevD.01
frameworkgroup: C1[X(C23H18O)]
method: RPBEPBE
basis: SDD
operation: Freq
keyword: #pfreq=noraman
keyword: PBEPBE/SDD
title: #p freq=noraman PBEPBE/SDD
converged: YES YES NO NO
title: Mulliken charges:
elementType: O C C C C C C C C C C C C C C C C C C C C C C C H H H H H H H H H H H H H H H H H H
charge: -0.176344 -0.529072 0.181587 0.318761 0.076875 0.142220 0.297028 0.197281 0.296448 -0.423091 -0.398869 -0.250678 -0.244005 -0.776825 -0.374631 -0.391802 -0.387882 -0.433886 -0.258023 -0.237646 -0.225027 -0.237230 -0.249679 -0.246065 0.267659 0.230562 0.265121 0.226057 0.226507 0.241377 0.243573 0.259690 0.229010 0.257827 0.264287 0.255577 0.223530 0.227346 0.228293 0.226396 0.228891 0.228853
chargesum: 0.00000
title: Mulliken charges with hydrogens summed into heavy atoms:
elementType: O C C C C C C C C C C C C C C C C C C C C C C C
charge: -0.176344 -0.261414 0.181587 0.318761 0.076875 0.142220 0.297028 0.197281 0.296448 -0.192529 -0.133748 -0.024621 -0.017498 -0.032185 -0.145621 -0.133975 -0.123595 -0.178309 -0.034493 -0.010300 0.003265 -0.010834 -0.020788 -0.017212
polarizability: 3.23946336e+02 -2.14568562e+01 3.16497781e+02 9.45151237e+00 -1.08484779e+01 1.49656756e+02
1716.lowfreq: -12.1256 -7.4110 -1.6311 0.0001 0.0007 0.0007 20.0884 33.9716 53.9929
frequency: 20.0838 33.7978 53.9892 56.7793 61.7326 64.7782 88.8244 102.1808 106.7110 131.9763 186.4358 197.2346 227.3442 251.1848 275.0744 280.8557 296.7424 357.0397 388.7885 401.3755 404.7501 428.2276 473.4432 488.0687 512.9432 534.8707 561.0850 588.8839 609.5958 612.9359 618.3895 637.9741 654.4716 671.6973 694.8097 705.6629 729.2473 737.3530 758.8855 766.9566 788.0736 809.1014 841.4208 842.3707 860.0796 876.0710 882.5769 914.5636 928.0361 933.8650 941.9490 961.6641 972.4094 981.4320 985.9503 987.5789 988.6665 993.3163 997.6570 1009.2088 1020.9073 1026.3229 1028.9839 1052.9895 1080.6783 1087.4514 1100.4272 1143.9883 1162.5704 1170.2013 1172.4997 1172.8009 1175.6143 1190.9773 1193.7220 1198.9672 1224.6397 1256.2191 1295.0600 1317.2433 1320.5439 1354.2699 1364.2774 1369.7811 1371.9318 1400.7284 1431.4945 1434.2164 1440.8081 1445.7880 1449.9603 1457.9730 1475.9395 1488.9424 1568.2218 1578.3495 1584.2794 1593.7856 1605.7228 1609.9845 1613.5441 1639.4088 2981.1442 3011.1297 3067.1465 3121.6829 3122.0701 3123.8396 3124.0151 3129.7580 3132.8541 3133.7937 3141.9403 3148.0956 3150.4101 3152.1253 3160.0180 3163.2141 3165.2434 3169.1590
redmass: 4.1713 4.5579 4.3156 3.9338 4.4078 4.9638 5.0290 1.2941 4.9503 2.5874 5.1309 4.6602 5.1905 4.6535 5.4448 3.7177 5.4426 4.3775 4.4776 2.8997 2.8634 3.0743 4.1046 3.9335 3.9862 3.6923 3.7723 5.2922 6.0451 6.1472 5.5130 4.7566 5.0986 5.8057 1.6953 1.8819 4.2057 2.0618 1.6094 1.8728 2.8614 4.0456 2.1022 1.6507 1.2537 1.4255 5.0052 1.4603 1.8988 2.4196 1.4224 2.5846 1.4190 1.3563 1.3987 5.0546 5.0048 1.3517 1.3169 1.9796 2.5833 2.1809 2.1466 2.2705 1.6535 1.7986 1.9400 1.8737 1.6227 1.2318 1.0851 1.1921 1.5968 1.1694 2.2624 1.1441 1.7227 2.5305 1.8548 1.4607 1.4822 3.0733 1.2372 6.4250 5.2973 5.8990 2.3205 2.3556 1.0667 2.4085 1.1366 2.5806 2.2560 2.5054 6.4391 5.8322 6.6694 7.4937 6.5743 6.3722 6.3643 8.0515 1.0380 1.0834 1.0942 1.0859 1.0871 1.0965 1.0868 1.0878 1.0889 1.0885 1.0929 1.0937 1.0929 1.0963 1.0947 1.1001 1.1014 1.1000
irintensity: 0.3644 0.7731 0.9853 2.8073 0.8041 1.5787 0.6949 0.4355 0.4297 0.4585 0.6794 0.3861 0.7355 1.5898 0.2074 0.8361 1.0797 0.2522 1.1697 0.1121 0.1590 2.9609 2.3093 5.0780 1.5661 13.8480 22.4785 12.3644 1.7771 0.7268 1.7200 2.7029 1.4272 1.9964 46.1610 45.7719 12.6846 43.8038 14.0173 71.2519 25.0743 4.0708 5.3097 0.8091 0.3182 1.1009 0.3111 1.9735 1.6692 2.8340 0.3455 19.0726 1.0922 0.2871 0.3956 0.2726 0.2698 0.2858 0.3053 1.2226 1.9296 17.9064 6.2111 4.4516 6.2699 11.5942 1.8447 55.9688 25.3333 11.4169 3.2607 5.4719 4.0233 0.8060 9.4238 0.6712 102.3906 0.2823 10.8267 0.3430 2.9552 9.2898 73.0695 0.2256 0.4823 5.3265 9.4383 8.1415 19.9996 5.5899 7.0235 32.4770 16.6759 13.2706 0.0656 3.8181 1.9762 1.8672 2.6495 16.1877 4.4064 84.0370 2.8404 14.2453 9.3627 10.3710 2.3504 7.4796 3.6599 1.6014 12.1410 7.1216 29.0897 14.7037 34.4948 29.5843 29.3857 37.7584 20.0417 13.3577
temp: 298.150 k
press: 1.00000 atm
elementType: 8 6 6 6 6 6 6 6 6 6 6 6 6 6 6 6 6 6 6 6 6 6 6 6 1 1 1 1 1 1 1 1 1 1 1 1 1 1 1 1 1 1
symmnumber: 1
zpe: 874105.5 jmol-1
zpe.correction: 0.332929 hartree
zpe.thermalcorrener: 0.352984 hartree
zpe.thermalcorrenthalpy: 0.353928 hartree
zpe.thermalcorrgfe: 0.282449 hartree
zpe.sumelectzpe: -960.838545 hartree
zpe.sumelectthermal: -960.818490 hartree
zpe.sumelectthermalent: -960.817546 hartree
zpe.sumelectthermalfe: -960.889025 hartree
dipole: -0.4857 -0.6162 -2.3228
dipole: 2.4517
quadrupole: -121.2112 -119.9302 -148.1223
quadrupole: 5.7350 4.6650 0.6251
quadrupole: 8.5433 9.8244 -18.3677 5.7350 4.6650 0.6251
hfenergy: -961.1714745 hartree
pointgroup: C01 [X(C23H18O1)]
dipole: 0.1466836 -0.3703364 0.8784822 debye
polarizability: 328.8270727|18.0387903|306.7557794|15.4232465|28.4194771|154.5180207 unknown
InChI: InChI=1S/C23H18O/c1-16(24)21-19-14-8-9-15-20(19)22(17-10-4-2-5-11-17)23(21)18-12-6-3-7-13-18/h2-15,21H,1H3
charge 0 multiplicity 1
42 atoms
O  1.169021 -1.85004 -2.238098
C  1.18694 -1.551091 0.214117
C  -0.107249 -0.732753 0.17471
C  2.269158 -0.48918 0.430532
C  0.192307 0.624003 0.210301
C  1.652911 0.796087 0.370195
C  -1.435675 -1.381049 0.198725
C  1.521774 -2.293832 -1.119308
C  -0.745699 1.766761 0.059442
C  3.65582 -0.617958 0.607277
C  2.439873 1.966152 0.461454
C  4.441424 0.558301 0.726553
C  3.837275 1.83617 0.643436
C  2.316478 -3.585475 -0.971875
C  -1.657873 -2.650479 -0.410435
C  -2.528255 -0.78221 0.895464
C  -1.634438 1.818698 -1.049642
C  -0.754674 2.841965 0.989872
C  -2.916375 -3.284784 -0.341832
C  -3.784327 -1.416001 0.964533
C  -2.514279 2.908344 -1.216229
C  -1.641074 3.929766 0.826056
C  -3.989354 -2.671594 0.344281
C  -2.524021 3.967985 -0.2780
H  1.171799 -2.300337 1.028466
H  4.139067 -1.600118 0.663266
H  1.97891 2.956185 0.384822
H  5.523459 0.476558 0.87747
H  4.460671 2.734128 0.719891
H  3.171158 -3.454937 -0.284238
H  1.666803 -4.366446 -0.529693
H  2.674395 -3.928405 -1.95489
H  -0.855242 -3.132451 -0.977001
H  -2.380597 0.176834 1.400798
H  -1.619862 1.002991 -1.780185
H  -0.084678 2.810434 1.856937
H  -3.060969 -4.254702 -0.83116
H  -4.602858 -0.93419 1.511148
H  -3.189388 2.933615 -2.078963
H  -1.64257 4.744654 1.558892
H  -4.966552 -3.164124 0.398659
H  -3.208635 4.813723 -0.407647
