program: Gaussian 09
title: 000298599
version: EM64L-G09RevD.01
frameworkgroup: C1[X(C6H9NO)]
method: RPBEPBE
basis: SDD
operation: Freq
keyword: #pfreq=noraman
keyword: PBEPBE/SDD
title: #p freq=noraman PBEPBE/SDD
converged: YES YES NO NO
title: Mulliken charges:
elementType: O N C C C C C C H H H H H H H H H
charge: -0.226516 -0.157671 -0.116975 -0.556987 0.164099 -0.034296 -0.635311 -0.565744 0.240081 0.248235 0.246792 0.233975 0.235497 0.228137 0.259539 0.220667 0.216480
chargesum: 0.00000
title: Mulliken charges with hydrogens summed into heavy atoms:
elementType: O N C C C C C C
charge: -0.226516 -0.157671 0.123105 -0.061960 0.164099 0.199678 0.087862 -0.128597
polarizability: 1.02363917e+02 6.11896390e+00 6.54838097e+01 5.47578586e+00 9.01617923e-01 5.32104756e+01
1716.lowfreq: -6.0214 0.0006 0.0009 0.0010 5.2101 12.7187 80.9826 91.1852 117.2059
frequency: 80.9748 91.1825 117.1983 154.9021 229.8643 291.5022 326.3247 421.2068 464.0217 530.0950 655.1940 706.4535 774.1693 816.0359 932.8238 951.4349 958.3356 1002.9495 1008.9052 1039.4912 1056.8499 1116.6807 1158.5088 1187.4843 1199.7391 1247.8180 1278.0497 1303.2756 1356.0152 1424.5196 1430.4835 1444.1285 1465.0377 1489.3334 1653.4288 1727.9504 2967.6355 3002.3760 3045.7948 3046.8972 3085.2523 3093.8520 3097.4430 3122.8446 3200.2612
redmass: 3.0182 4.3819 1.0435 2.3508 3.0358 2.3072 2.5360 4.4312 2.8925 2.7462 2.1858 3.2004 3.2452 2.0566 2.1715 1.3563 1.8865 1.4451 1.6383 2.2233 1.7018 1.3155 1.4137 1.9854 1.5278 2.4357 1.2911 1.2912 4.6969 1.1683 1.2139 1.1530 1.0442 1.0734 4.7068 10.9833 1.0348 1.0865 1.1004 1.0606 1.0665 1.0986 1.0875 1.1066 1.1142
irintensity: 0.2674 2.9533 0.7628 7.5896 3.9934 3.8342 2.2089 2.6874 6.4238 3.7484 7.9320 2.1129 1.4569 0.2655 22.4039 64.2637 34.2331 16.1274 2.2853 46.1891 23.7969 0.4243 3.4833 6.6306 7.2935 10.5406 2.0820 16.2356 76.3156 27.3055 24.7107 5.6320 17.0269 6.8979 0.0764 506.1108 53.9928 32.7996 32.7765 12.8873 16.0216 6.9810 3.5633 13.7345 21.5894
temp: 298.150 k
press: 1.00000 atm
elementType: 8 7 6 6 6 6 6 6 1 1 1 1 1 1 1 1 1
symmnumber: 1
zpe: 363394.0 jmol-1
zpe.correction: 0.138409 hartree
zpe.thermalcorrener: 0.147010 hartree
zpe.thermalcorrenthalpy: 0.147954 hartree
zpe.thermalcorrgfe: 0.104858 hartree
zpe.sumelectzpe: -363.361118 hartree
zpe.sumelectthermal: -363.352517 hartree
zpe.sumelectthermalent: -363.351573 hartree
zpe.sumelectthermalfe: -363.394669 hartree
dipole: 4.0776 1.0018 0.9356
dipole: 4.3019
quadrupole: -59.0525 -44.8745 -45.4851
quadrupole: -2.5926 -2.0511 -0.3551
quadrupole: -9.2485 4.9295 4.3189 -2.5926 -2.0511 -0.3551
hfenergy: -363.4995273 hartree
pointgroup: C01 [X(C6H9N1O1)]
dipole: 1.6168717 0.3584849 0.3488617 debye
dipolederiv: -1.4610125 -0.2509117 -0.1960945 0.0726188 -0.4693817 0.0174126 -0.2629212 -0.0529266 -0.3807061 -0.8371368 -0.3144805 -0.0369941 -0.281614 -0.7730453 -0.0624013 0.0484188 -0.020153 -0.3585557 0.4893857 -0.1346871 0.0423071 -0.2971578 0.1053566 -0.0319659 -0.0532297 -0.0388653 0.3358067 -0.2697331 0.1640122 -0.0891962 0.2193795 -0.1872557 0.0397138 -0.0277618 0.0492577 0.1371738 1.8807723 0.4707652 0.3494906 0.3111358 0.9404134 0.0327866 0.3888288 0.0744264 0.1796284 0.1474122 0.0767833 -0.0025703 0.0980281 -0.2252846 0.0407777 -0.088788 0.0176083 0.1083104 -0.001698 0.0224845 -0.0534417 -0.0122593 0.4118295 0.0455702 -0.0894239 0.0186801 0.2722039 -0.2189492 0.0184621 -0.0228347 0.0154473 -0.3693854 0.024254 0.0092294 0.0293409 0.1124701 -0.0555683 0.0124604 -0.0852111 0.0137818 0.0572057 -0.0384734 -0.066511 -0.0054467 -0.1422622 0.0414417 -0.011117 0.0314122 -0.0370715 0.0123324 0.0738723 0.0236653 0.1172728 -0.0258454 0.1004364 0.0514003 0.0323516 0.0344057 0.0102418 -0.0639442 0.0374503 -0.1068588 -0.0157586 0.0441897 -0.0215598 -0.0661766 -0.0367595 0.1422271 -0.0190516 0.0017675 -0.0151131 -0.101131 0.0284746 -0.1068873 0.1207309 -0.055352 -0.0297983 0.0169162 0.105431 0.0785251 -0.0071013 0.110891 -0.0404676 -0.0486131 -0.0225305 -0.0605674 -0.0495417 -0.0248173 -0.1415888 -0.1176847 -0.0446543 0.0920838 -0.0571693 0.0155506 0.0655697 -0.002348 -0.0527099 0.0222347 0.1132227 -0.0434323 -0.0166133 0.0868024 -0.02077 0.1910222 -0.0049022 0.1014794 -0.0025165 0.0006097 0.0891808 -0.0117273 -0.0047932 -0.016833 0.1785198 -0.018675 -0.0501074 -0.0238771 -0.1103807 unknown
polarizability: 102.741306|5.2908937|65.2270261|4.9284055|0.6680681|53.0898705 unknown
InChI: InChI=1S/C6H9NO/c1-3-5-4-6(8)7(5)2/h3,5H,1,4H2,2H3
charge 0 multiplicity 1
17 atoms
O  -2.672766 -0.368288 -0.292102
N  -0.514099 0.634391 0.158442
C  0.636528 -0.281856 0.482506
C  -0.377676 -1.477682 0.278016
C  -1.45376 -0.388869 -0.0146
C  1.796777 -0.201796 -0.4745
C  -0.613062 2.085281 0.098445
C  3.088431 -0.029869 -0.096974
H  0.982318 -0.170771 1.527948
H  -0.573432 -2.083927 1.17622
H  -0.15365 -2.13475 -0.577369
H  1.539308 -0.296139 -1.540678
H  0.109222 2.507728 -0.624694
H  -0.4317 2.548331 1.087757
H  -1.634805 2.343681 -0.228196
H  3.902573 0.006603 -0.82875
H  3.368293 0.071133 0.959531
