program: Gaussian 09
title: 000298577
version: EM64L-G09RevD.01
frameworkgroup: C1[X(C8H17ClOS)]
method: RPBEPBE
basis: SDD
operation: Freq
keyword: #p
keyword: freq=noraman
keyword: PBEPBE/SDD
title: #p freq=noraman PBEPBE/SDD
converged: YES YES NO NO
title: Mulliken charges:
elementType: Cl S O C C C C C C C C H H H H H H H H H H H H H H H H H
charge: -0.042388 0.672904 -0.629159 -0.591120 -0.625426 -0.296795 -0.314448 -0.330607 -0.343296 -0.686260 -0.686038 0.321409 0.264228 0.262194 0.248806 0.227815 0.241894 0.201182 0.198060 0.213625 0.194648 0.200003 0.213239 0.216113 0.221632 0.219001 0.210917 0.217866
chargesum: 0.00000
title: Mulliken charges with hydrogens summed into heavy atoms:
elementType: Cl S O C C C C C C C C
charge: -0.042388 0.672904 -0.629159 -0.269712 -0.099003 0.179825 0.128629 0.081079 0.051354 -0.035275 -0.038254
polarizability: 1.65332480e+02 9.92687388e-01 1.23360736e+02 4.52744735e-01 -1.62823631e-01 8.97563595e+01
1716.lowfreq: -6.0018 -0.0016 -0.0010 0.0025 3.0544 7.0469 23.7221 28.6531 53.4014
frequency: 22.8621 28.3895 53.3925 72.6787 82.3384 86.4967 115.5343 133.1310 143.6313 190.0229 221.3664 231.7737 236.4044 244.3486 281.6100 308.7122 373.3303 393.9679 447.9882 590.5313 600.8413 649.5912 742.2939 754.4035 777.0341 797.7483 877.6994 889.3416 895.1277 911.5645 1023.4059 1030.2744 1051.6327 1060.6724 1074.5311 1087.9936 1103.2163 1115.7647 1140.9033 1199.9373 1204.2835 1220.4006 1256.2231 1275.5253 1290.2459 1296.0055 1303.0565 1312.6855 1347.2795 1351.4939 1392.2307 1393.4836 1413.0497 1445.9523 1470.3292 1474.4300 1476.0941 1477.5360 1478.1499 1485.6291 1488.3304 2969.8468 2970.3777 2977.5315 2978.3411 2980.6012 2983.9731 3014.8841 3021.8154 3027.7575 3045.5689 3048.7344 3075.1977 3077.0143 3077.8192 3080.0919 3082.2638 3115.8435
redmass: 2.9587 3.2607 3.9186 2.3540 2.1052 2.5419 2.1908 3.6242 5.6883 3.9393 2.1211 1.4411 1.3961 4.0534 3.6242 3.7541 6.2242 3.1145 3.1774 4.8115 4.8867 6.2188 1.0792 1.1222 1.9735 2.4378 1.2740 1.8577 1.7984 1.2557 2.8012 2.7018 1.1845 1.9610 2.5379 1.8036 2.0323 2.1892 1.2819 1.5167 1.4225 1.2456 1.2323 1.2052 1.1343 1.0662 1.2876 1.2589 1.4870 1.4935 1.2084 1.2081 1.1062 1.0790 1.0663 1.0577 1.0534 1.0529 1.0416 1.0750 1.0840 1.0585 1.0602 1.0366 1.0357 1.0596 1.0617 1.1002 1.0561 1.0970 1.1035 1.1015 1.1005 1.1000 1.1000 1.0994 1.0904 1.1087
irintensity: 0.5213 3.5665 0.4724 1.9544 0.8893 3.4360 0.1183 6.4872 6.2077 5.5029 3.6613 0.4318 1.2037 0.1400 5.8476 2.2177 8.4759 0.6545 2.3286 27.1777 8.5877 6.6628 10.8906 15.3594 21.2175 16.7129 5.9462 4.6932 4.4424 3.6646 4.8809 3.3577 0.0022 2.5170 1.3146 24.6054 4.4966 8.9040 27.9298 0.8005 7.0154 1.6445 10.3994 0.1411 7.8208 1.7077 7.9611 2.6156 12.7551 4.6781 8.1795 8.5309 4.4027 7.8885 1.5826 3.7725 6.7123 8.6660 14.1276 14.0391 18.9918 15.1633 0.6442 39.7594 33.9875 37.5238 27.9953 7.0623 14.0575 3.1947 12.2546 5.8068 59.7505 48.4139 48.6921 44.2362 23.9014 14.8794
temp: 298.150 k
press: 1.00000 atm
elementType: 17 16 8 6 6 6 6 6 6 6 6 1 1 1 1 1 1 1 1 1 1 1 1 1 1 1 1 1
symmnumber: 1
zpe: 618604.3 jmol-1
zpe.correction: 0.235614 hartree
zpe.thermalcorrener: 0.251274 hartree
zpe.thermalcorrenthalpy: 0.252218 hartree
zpe.thermalcorrgfe: 0.190100 hartree
zpe.sumelectzpe: -1247.397649 hartree
zpe.sumelectthermal: -1247.381990 hartree
zpe.sumelectthermalent: -1247.381045 hartree
zpe.sumelectthermalfe: -1247.443164 hartree
dipole: -0.2129 2.1517 0.7084
dipole: 2.2753
quadrupole: -73.0444 -95.6030 -82.3118
quadrupole: -5.1070 0.6388 -0.5806
quadrupole: 10.6086 -11.9499 1.3413 -5.1070 0.6388 -0.5806
hfenergy: -1247.6332634 hartree
pointgroup: C01 [X(C8H17Cl1O1S1)]
dipole: 0.1142794 0.8577101 -0.2293446 debye
polarizability: 165.2005484|-2.5724907|123.3607783|-0.0612433|2.1324988|89.8882495 unknown
InChI: InChI=1S/C8H17ClOS/c1-3-5-7-11(10)8(9)6-4-2/h8H,3-7H2,1-2H3
charge 0 multiplicity 1
28 atoms
Cl -1.434442 2.372013 0.563901
S  0.123748 -0.296245 1.010891
O  0.143359 -1.802207 0.265699
C  -1.36354 0.561108 0.044244
C  1.565619 0.660442 0.11265
C  -2.651598 -0.184294 0.343561
C  2.869047 -0.109099 0.340595
C  -3.837459 0.251265 -0.550959
C  4.041516 0.495851 -0.472248
C  -5.113965 -0.55777 -0.236143
C  5.362179 -0.270169 -0.241688
H  -1.069887 0.544131 -1.018075
H  1.561405 1.676815 0.539728
H  1.276303 0.680712 -0.95277
H  -2.436234 -1.260371 0.172445
H  -2.917488 -0.064838 1.411697
H  2.715461 -1.164873 0.042301
H  3.132068 -0.107168 1.417498
H  -3.561593 0.112677 -1.615625
H  -4.030906 1.331447 -0.407777
H  4.176496 1.5616 -0.19798
H  3.78525 0.477055 -1.550682
H  -5.425165 -0.415842 0.815632
H  -4.950572 -1.639666 -0.396599
H  -5.953294 -0.242416 -0.881766
H  6.187711 0.168601 -0.831089
H  5.656236 -0.244043 0.824263
H  5.260846 -1.331014 -0.536703
