program: Gaussian 09
title: 000298648
version: EM64L-G09RevD.01
frameworkgroup: C1[X(C25H22O2)]
method: RPBEPBE
basis: SDD
operation: Freq
keyword: #pfreq=noraman
keyword: PBEPBE/SDD
title: #p freq=noraman PBEPBE/SDD
converged: YES YES NO NO
title: Mulliken charges:
elementType: O O C C C C C C C C C C C C C C C C C C C C C C C C C H H H H H H H H H H H H H H H H H H H H H H
charge: -0.219743 -0.194566 0.021137 -0.411746 -0.452227 0.196549 0.328234 0.396900 0.522178 0.170535 0.205281 -0.397743 -0.410847 -0.365124 -0.411139 -0.423672 -0.401101 -0.781454 -0.262702 -0.242384 -0.799877 -0.253296 -0.240919 -0.228503 -0.252405 -0.249172 -0.246923 0.283574 0.269295 0.258219 0.253229 0.254090 0.252383 0.228233 0.254863 0.267124 0.247966 0.253335 0.227899 0.228481 0.250767 0.281891 0.236750 0.226959 0.225869 0.223688 0.223966 0.229255 0.226892
chargesum: 0.00000
title: Mulliken charges with hydrogens summed into heavy atoms:
elementType: O O C C C C C C C C C C C C C C C C C C C C C C C C C
charge: -0.219743 -0.194566 0.021137 -0.128172 -0.182932 0.196549 0.328234 0.396900 0.522178 0.170535 0.205281 -0.139524 -0.157618 -0.111033 -0.158756 -0.195440 -0.146238 -0.013029 -0.034803 -0.013903 -0.030469 -0.026336 -0.015050 -0.004815 -0.028439 -0.019917 -0.020031
polarizability: 2.92099350e+02 7.92045697e-01 2.23317250e+02 1.75695140e+01 -5.09504234e+00 2.55868627e+02
1716.lowfreq: -11.8835 -4.6500 0.0003 0.0007 0.0008 1.7772 28.1995 41.2681 43.4018
frequency: 28.1406 41.1985 43.3457 49.9419 53.9383 66.3706 67.1201 85.6212 96.6632 121.0225 127.2734 145.3159 156.8810 162.8657 197.4135 223.7419 236.4934 245.6742 266.8096 297.9992 303.2724 317.2443 329.9361 376.2840 403.8128 407.4296 440.2124 455.9645 464.7166 506.5224 518.4071 538.0638 541.5403 567.5255 598.2301 602.8903 615.7481 617.0072 629.9037 638.7026 671.5284 704.8534 711.1298 715.8863 735.8180 753.7069 764.6105 782.4873 805.1886 836.0618 853.1792 861.4782 865.9960 881.7938 906.6513 911.5744 919.1443 938.6070 950.3844 959.6230 977.8343 978.1745 985.4515 989.7657 990.0129 991.5978 995.0093 998.8397 1004.2549 1011.8098 1024.0789 1027.0197 1030.1541 1031.2238 1038.9098 1086.4014 1087.3288 1091.6903 1152.5244 1157.0333 1171.8672 1173.2410 1174.4526 1176.1301 1182.6630 1192.7556 1199.2408 1206.6533 1217.3300 1231.7895 1258.6112 1268.5554 1289.2479 1301.1466 1329.4275 1344.6117 1364.0476 1370.4095 1374.9315 1383.7441 1389.1040 1435.8571 1440.5426 1441.6498 1444.9159 1449.5560 1454.8858 1455.7438 1471.8372 1484.1877 1484.9339 1586.2622 1590.4791 1594.8528 1603.3630 1609.1049 1612.9980 1616.4284 1626.9543 2963.7114 2984.9245 2995.8909 3054.4772 3076.7357 3086.6356 3114.9510 3116.3195 3117.1295 3120.5700 3123.2297 3124.8565 3126.8276 3133.9975 3135.8832 3139.6096 3143.6061 3148.2258 3153.8099 3161.4216 3163.6171 3165.5470
redmass: 5.8532 4.3413 5.0006 5.6679 4.9423 4.1489 3.9961 4.3834 4.6314 4.5678 4.1941 1.0181 4.3622 1.0599 5.0760 4.9537 4.4567 4.6970 4.5346 4.7638 4.2933 5.7041 3.8702 4.4956 2.8363 2.8762 3.7136 3.7021 3.9223 3.5145 3.7184 3.7895 3.7069 3.9917 3.4245 5.2101 5.8818 6.0571 4.8240 4.7219 5.1052 2.0717 1.8424 2.5532 4.4321 1.6032 1.5973 2.3692 3.8298 2.6323 1.2651 1.2593 3.9980 1.4379 3.1552 2.6187 1.5838 1.9129 1.6407 2.0178 1.3885 1.9649 1.3817 1.4792 3.8582 5.6405 1.3690 1.3964 2.5800 2.4569 2.2041 2.3707 2.1328 2.1625 2.1848 1.7910 2.0023 1.7824 1.8829 1.6677 1.0583 1.1368 1.0577 2.8202 2.1781 1.1348 1.2944 2.2077 2.3060 1.3273 2.8608 1.4696 1.6477 1.7158 1.3716 1.3129 1.2607 1.2228 6.2122 5.5010 7.3334 2.2590 1.1542 1.9154 2.1715 1.0735 1.0845 1.0803 2.5281 2.2615 2.1768 6.1226 5.9546 7.1312 7.3570 6.3247 6.1306 7.3703 8.9346 1.0814 1.0362 1.0371 1.0836 1.0964 1.0944 1.1010 1.0867 1.0857 1.0868 1.0941 1.0930 1.0867 1.0914 1.0897 1.0924 1.0960 1.0947 1.0949 1.1014 1.1002 1.1003
irintensity: 1.8636 0.4890 1.9154 1.4865 1.5835 0.4191 1.0474 0.6852 1.1646 3.2582 0.9378 0.2269 1.8099 0.9721 2.5021 1.8663 0.4406 1.1484 0.0395 1.5434 2.4678 1.2440 1.8648 1.8552 0.0094 0.0405 2.5287 4.3369 2.2809 0.9266 2.7142 4.1514 10.7241 32.8365 32.3948 2.0322 2.0944 1.3812 5.7678 2.1494 0.3218 57.9779 19.5979 43.8341 5.1081 48.6138 5.5624 37.3337 6.3416 4.5235 0.2203 2.1913 0.6754 0.3518 0.6961 0.2198 1.5666 2.4265 2.1699 1.5378 0.2320 6.9587 0.9319 0.1206 0.0302 1.1093 0.0185 1.1102 6.6141 3.4065 1.2986 8.5221 3.0658 6.3092 8.2476 10.5352 4.3717 5.5438 12.2311 37.7993 1.6229 9.5077 0.1914 86.5454 80.2782 1.0596 2.8263 6.5194 3.0012 37.0053 11.3774 0.7904 0.8082 10.6102 0.3630 2.9512 68.2610 57.8963 0.0020 0.9013 0.9888 5.3866 13.0083 19.4156 10.0340 11.6946 12.7157 26.4134 20.3609 24.3561 19.8386 9.3520 3.2049 4.2808 34.3151 47.3246 11.7550 52.7557 97.4688 17.1140 6.1486 0.9846 8.2844 7.6076 8.4788 18.9409 2.7602 5.6394 0.2759 9.3749 5.3552 0.3655 12.9862 10.9823 20.3213 32.7943 25.1798 25.7659 27.0901 28.6911 15.4084
temp: 298.150 k
press: 1.00000 atm
elementType: 8 8 6 6 6 6 6 6 6 6 6 6 6 6 6 6 6 6 6 6 6 6 6 6 6 6 6 1 1 1 1 1 1 1 1 1 1 1 1 1 1 1 1 1 1 1 1 1 1
symmnumber: 1
zpe: 1029521.5 jmol-1
zpe.correction: 0.392124 hartree
zpe.thermalcorrener: 0.415917 hartree
zpe.thermalcorrenthalpy: 0.416861 hartree
zpe.thermalcorrgfe: 0.338057 hartree
zpe.sumelectzpe: -1114.426661 hartree
zpe.sumelectthermal: -1114.402868 hartree
zpe.sumelectthermalent: -1114.401924 hartree
zpe.sumelectthermalfe: -1114.480728 hartree
dipole: -3.3812 -0.5398 1.8938
dipole: 3.9128
quadrupole: -162.1292 -147.4988 -150.6007
quadrupole: 0.1553 9.0301 -1.2584
quadrupole: -8.7196 5.9108 2.8088 0.1553 9.0301 -1.2584
hfenergy: -1114.818785 hartree
pointgroup: C01 [X(C25H22O2)]
dipole: -1.3031656 0.2467566 -0.7814617 debye
polarizability: 293.1707315|-0.9705212|223.6131346|-16.4521823|-5.7376387|254.5013614 unknown
InChI: InChI=1S/C25H22O2/c1-17(26)23-21-15-9-10-16-22(21)25(18(2)27,20-13-7-4-8-14-20)24(23)19-11-5-3-6-12-19/h3-16,23-24H,1-2H3
charge 0 multiplicity 1
49 atoms
O  1.140103 0.675115 2.752236
O  3.895385 -1.150272 1.128392
C  0.235837 0.644954 0.449156
C  0.238557 -0.938431 0.668778
C  1.655508 -1.387604 0.146234
C  1.195856 0.817332 -0.738197
C  2.031251 -0.319393 -0.865796
C  -1.172503 1.241371 0.287057
C  -0.907097 -1.667336 -0.030445
C  0.917115 1.325195 1.696538
C  2.727847 -1.601242 1.249994
C  1.373994 1.930524 -1.587216
C  3.05808 -0.354393 -1.828454
C  -1.771166 1.38067 -0.990944
C  -1.935212 1.596622 1.430557
C  -2.05466 -2.036464 0.717263
C  -0.872643 -1.993947 -1.411906
C  1.308733 2.789134 1.587428
C  2.392702 1.890822 -2.568391
C  3.233859 0.757413 -2.686333
C  2.314577 -2.430367 2.457263
C  -3.088098 1.870592 -1.122585
C  -3.251557 2.091792 1.301241
C  -3.136873 -2.710495 0.109464
C  -1.951977 -2.668548 -2.024181
C  -3.834672 2.232956 0.021808
C  -3.090064 -3.029779 -1.26677
H  0.148326 -1.11128 1.754189
H  1.561071 -2.386551 -0.330668
H  0.731332 2.813481 -1.498547
H  3.717876 -1.224642 -1.904758
H  -1.212126 1.089832 -1.885907
H  -1.505556 1.480387 2.433367
H  -2.098898 -1.791035 1.785707
H  -0.001642 -1.717646 -2.017353
H  2.276322 2.867255 1.057131
H  0.567755 3.370876 1.015107
H  1.430929 3.213186 2.596361
H  2.532824 2.74489 -3.24054
H  4.025851 0.744357 -3.443342
H  3.199441 -2.920001 2.894596
H  1.887058 -1.745365 3.214122
H  1.544746 -3.180242 2.204049
H  -3.5342 1.961524 -2.119433
H  -3.820709 2.36237 2.197857
H  -4.012152 -2.987803 0.707919
H  -1.904992 -2.912252 -3.091898
H  -4.856534 2.614576 -0.081673
H  -3.926306 -3.555536 -1.741278
