program: Gaussian 09
title: 000298585
version: EM64L-G09RevD.01
frameworkgroup: C1[X(C17H26OS)]
method: RPBEPBE
basis: SDD
operation: Freq
keyword: #p
keyword: freq=noraman
keyword: PBEPBE/SDD
title: #p freq=noraman PBEPBE/SDD
converged: YES YES NO NO
title: Mulliken charges:
elementType: S O C C C C C C C C C C C C C C C C C H H H H H H H H H H H H H H H H H H H H H H H H H H
charge: 0.210689 -0.464860 0.040883 0.335570 0.429250 -0.521217 -0.529362 -0.479762 -0.501757 -0.804380 -0.746126 -0.759112 -0.751381 -0.159669 -0.182848 -0.274386 -0.244845 -0.209303 -0.239487 0.179680 0.217181 0.214351 0.188891 0.233125 0.220295 0.193262 0.177955 0.254307 0.265314 0.289293 0.217132 0.210143 0.209865 0.214722 0.222041 0.212440 0.210411 0.210508 0.219493 0.331299 0.228036 0.250511 0.224872 0.227999 0.228980
chargesum: 0.00000
title: Mulliken charges with hydrogens summed into heavy atoms:
elementType: S O C C C C C C C C C C C C C C C C C
charge: 0.210689 -0.133561 0.220563 0.335570 0.429250 -0.089685 -0.107346 -0.066205 -0.069495 -0.249773 -0.108986 -0.109910 -0.110969 -0.159669 0.045188 -0.023875 -0.019973 0.018696 -0.010507
polarizability: 2.72597155e+02 -1.56860887e+01 1.91784231e+02 5.66579534e+00 1.03543783e+01 1.45665401e+02
1716.lowfreq: -5.0282 0.0018 0.0019 0.0020 5.0913 13.2667 20.4865 35.4403 38.8722
frequency: 20.0077 33.8851 38.7258 53.9144 64.2406 101.1424 135.5537 163.5561 177.2963 192.0467 198.7821 206.6929 214.6996 242.4782 254.3834 262.4554 267.2897 306.5265 324.4774 336.6974 371.0526 378.4488 391.8522 396.3207 404.3229 421.6640 442.3318 468.1011 479.7474 486.7431 508.7965 598.9150 611.9235 673.3821 687.1614 694.5365 715.4319 745.4097 752.1537 774.9628 814.0725 835.3431 841.4771 904.2571 911.4857 920.7965 924.5882 926.2752 935.6826 937.0001 960.0681 967.4041 974.4190 985.1135 988.3719 1006.0143 1017.3248 1020.6651 1046.9660 1062.7053 1071.4642 1076.3122 1086.4289 1102.5032 1123.9699 1144.5600 1156.0761 1170.6808 1184.5739 1202.1132 1206.4143 1232.4991 1236.0781 1249.4422 1268.7032 1279.3444 1296.9285 1301.9814 1305.8013 1309.7545 1328.2744 1333.9097 1351.2569 1369.8109 1373.0891 1376.0192 1377.1890 1403.3527 1422.2159 1428.1944 1445.9094 1457.0739 1458.4433 1460.0824 1466.4231 1468.0068 1471.4269 1478.4742 1489.0451 1489.2256 1498.1122 1582.1039 1590.9740 2916.9911 2947.9273 2965.7294 2967.7432 2968.8596 2973.8252 2974.9172 2982.3173 3032.0390 3037.6893 3040.3645 3045.0768 3048.0499 3056.7643 3061.1010 3066.3898 3067.4211 3073.4859 3074.2986 3109.5406 3124.1958 3132.0067 3146.6127 3153.5680 3166.7831 3572.8085
redmass: 4.5011 3.6184 3.4363 2.7280 4.1589 5.3317 4.2074 1.8521 1.7757 1.8679 1.9459 2.0639 3.2624 1.7323 1.5247 1.0507 2.9486 1.9546 2.8327 2.7564 2.0444 2.5997 4.7300 2.2597 2.9922 2.9012 2.7748 2.2574 3.2491 3.3309 2.5197 3.0493 6.4216 6.3730 5.4015 2.1878 4.2468 1.5267 2.7094 1.5145 2.7314 1.7404 1.4435 1.3775 2.0065 1.4967 1.6941 1.6241 1.7881 1.3901 2.1414 1.4034 2.4998 6.0795 1.3121 1.4496 3.1753 1.4112 2.1024 1.7266 2.3654 1.6547 1.6372 1.6351 1.9037 1.6264 1.4371 1.0510 1.1196 1.5594 1.7937 2.0344 2.0098 1.5103 1.7796 1.4035 1.3806 1.3416 1.3638 1.3764 1.5075 1.4245 1.5953 1.7410 6.2625 1.2161 1.2129 1.2080 1.3490 1.5930 1.0909 1.1033 1.0549 2.0126 1.0497 1.0720 1.0564 1.0790 1.0522 1.0639 1.0574 6.1522 5.9927 1.0810 1.0689 1.0360 1.0612 1.0357 1.0617 1.0381 1.0604 1.0583 1.0925 1.0965 1.0989 1.1012 1.0997 1.0992 1.0986 1.0992 1.0982 1.0979 1.1060 1.0844 1.0877 1.0919 1.0958 1.1014 1.0656
irintensity: 0.2323 0.0420 0.0555 0.0814 0.6180 1.2298 0.4900 42.9018 56.3909 0.0350 1.1641 6.7977 8.1659 0.4828 1.2095 0.3068 1.0419 0.7113 0.9968 1.1018 0.3877 3.3368 0.2313 3.0012 0.7759 1.3184 0.8851 0.3091 13.2727 3.8150 6.3739 8.9905 0.7205 9.1703 12.1485 31.7080 13.1569 69.7099 0.7183 0.1333 4.6911 4.5191 3.3164 1.9132 1.6406 10.9439 5.1154 0.7048 13.2013 4.6952 6.0935 0.6789 38.2294 0.9767 0.0595 3.3739 20.7019 2.0175 4.6034 2.7382 17.2422 9.2929 2.3355 47.5588 0.2526 11.8555 8.0551 0.0253 1.4399 10.6603 2.3114 20.2711 9.8332 18.8280 7.2927 13.4870 4.3759 1.4548 0.6336 4.9273 2.3152 0.7963 5.4575 33.4950 0.8290 25.5325 21.3080 17.6258 5.0081 7.6725 9.7656 24.4923 2.1588 38.9987 2.2982 2.2302 1.0736 10.9988 9.8898 3.3142 34.2838 1.3165 40.3439 13.6076 31.1145 33.0687 9.1300 39.6621 52.6320 13.7025 47.1836 10.5959 54.8184 9.1901 2.5550 56.2867 3.6851 28.0448 72.2018 34.9387 61.1586 68.7870 5.8051 2.1569 4.3837 16.1818 34.6662 20.7747 1.8756
temp: 298.150 k
press: 1.00000 atm
elementType: 16 8 6 6 6 6 6 6 6 6 6 6 6 6 6 6 6 6 6 1 1 1 1 1 1 1 1 1 1 1 1 1 1 1 1 1 1 1 1 1 1 1 1 1 1
symmnumber: 1
zpe: 1019271.5 jmol-1
zpe.correction: 0.388220 hartree
zpe.thermalcorrener: 0.408826 hartree
zpe.thermalcorrenthalpy: 0.409770 hartree
zpe.thermalcorrgfe: 0.338489 hartree
zpe.sumelectzpe: -1135.210565 hartree
zpe.sumelectthermal: -1135.189959 hartree
zpe.sumelectthermalent: -1135.189015 hartree
zpe.sumelectthermalfe: -1135.260295 hartree
dipole: 2.1256 2.5252 1.1414
dipole: 3.4925
quadrupole: -115.5083 -128.0116 -125.8574
quadrupole: -4.3009 -2.5399 0.5573
quadrupole: 7.6175 -4.8859 -2.7316 -4.3009 -2.5399 0.5573
hfenergy: -1135.5987848 hartree
pointgroup: C01 [X(C17H26O1S1)]
dipole: 0.793627 -0.9609694 -0.5785126 debye
polarizability: 273.5233771|13.4592688|187.5602583|-5.0844552|15.5181954|148.9631511 unknown
InChI: InChI=1S/C17H26OS/c1-16(2,3)14-9-11-17(18,12-10-14)13-19-15-7-5-4-6-8-15/h4-8,14,18H,9-13H2,1-3H3
charge 0 multiplicity 1
45 atoms
S  -2.261402 1.635389 0.819781
O  0.771523 2.386126 0.803108
C  2.979336 -0.371005 -0.316038
C  4.464063 -0.805734 -0.00213
C  0.436184 1.294746 -0.150665
C  2.857047 1.029337 -0.97764
C  2.027272 -0.43378 0.909601
C  1.398189 1.363959 -1.369515
C  0.565467 -0.08662 0.532475
C  -0.993577 1.635511 -0.599961
C  5.282871 -0.856425 -1.323274
C  5.165755 0.168647 0.983295
C  4.472869 -2.234155 0.613825
C  -3.480133 0.367954 0.270467
C  -3.110882 -0.863149 -0.325422
C  -4.848215 0.636979 0.528974
C  -4.103771 -1.806182 -0.675477
C  -5.834155 -0.319134 0.196997
C  -5.468193 -1.541926 -0.41298
H  2.597447 -1.11449 -1.054782
H  3.486916 1.086001 -1.883682
H  3.231086 1.809957 -0.284978
H  2.392168 0.252938 1.704541
H  2.037726 -1.442022 1.361383
H  1.34808 2.379681 -1.805462
H  1.053136 0.649828 -2.145798
H  0.192199 -0.860054 -0.169844
H  -0.086546 -0.109903 1.425479
H  -1.355004 0.939981 -1.374438
H  -1.005538 2.662958 -1.000224
H  5.412333 0.144915 -1.771559
H  6.292761 -1.264809 -1.131203
H  4.791346 -1.506978 -2.072184
H  4.630006 0.234804 1.948289
H  5.246639 1.188137 0.5640
H  6.192109 -0.183462 1.199215
H  3.912931 -2.946834 -0.02234
H  5.510918 -2.606102 0.70426
H  4.027132 -2.253882 1.62427
H  1.520626 2.094082 1.380723
H  -2.055822 -1.098814 -0.500943
H  -5.135326 1.594595 0.976559
H  -3.807131 -2.754119 -1.138987
H  -6.888092 -0.10015 0.402454
H  -6.234647 -2.277996 -0.678967
