program: Gaussian 09
title: 000298527
version: EM64L-G09RevD.01
frameworkgroup: C1[X(C8H5NO3S)]
method: RPBEPBE
basis: SDD
operation: Freq
keyword: #p
keyword: freq=noraman
keyword: PBEPBE/SDD
title: #p freq=noraman PBEPBE/SDD
converged: NO NO NO NO
title: Mulliken charges:
elementType: S O O O N C C C C C C C C H H H H H
charge: 0.337790 -0.350985 -0.189925 -0.226345 0.077422 0.439669 -0.374769 0.191983 -0.197098 -0.313978 -0.244928 -0.241245 -0.224592 0.208816 0.255382 0.240113 0.241693 0.370997
chargesum: 0.00000
title: Mulliken charges with hydrogens summed into heavy atoms:
elementType: S O O O N C C C C C C C C
charge: 0.337790 0.020012 -0.189925 -0.226345 0.077422 0.439669 -0.374769 0.191983 -0.197098 -0.105162 0.010454 -0.001132 0.017100
polarizability: 2.05864457e+02 -8.50344705e+00 1.36222551e+02 8.32717256e-03 9.45254289e-03 4.43704816e+01
1716.lowfreq: -0.0014 -0.0007 0.0012 9.7547 12.1622 12.9530 72.0060 82.7663 138.4244
frequency: 72.0023 82.7626 138.4220 157.7819 226.8267 264.8975 279.8190 316.3438 330.8770 365.8646 428.9768 445.5236 490.6501 490.6985 510.6971 621.4919 623.0615 685.2419 693.4580 717.4310 726.5423 765.8982 851.4627 854.9753 945.4360 988.4847 999.4105 1025.9068 1037.8488 1115.1666 1143.3383 1180.4946 1187.6442 1235.7646 1267.2483 1327.5536 1361.7662 1399.0829 1430.6088 1457.7925 1555.1524 1596.9472 1600.3971 3102.7596 3143.7882 3158.4833 3174.0503 3545.1417
redmass: 10.9972 9.6055 3.9288 10.1934 6.5419 5.8158 4.8010 11.9600 1.4357 9.1038 2.5524 13.7140 4.6180 10.0797 9.4755 5.5830 7.1744 6.9580 11.4104 9.4639 2.4397 1.7316 5.3650 1.3776 1.3763 1.3369 9.9614 2.3106 6.4727 4.2209 1.5796 1.1068 1.7353 3.8578 1.6456 7.7926 4.1984 7.9843 2.4110 2.9769 6.0408 6.8580 6.3699 1.0896 1.0873 1.0939 1.1001 1.0659
irintensity: 0.4720 0.2112 1.9779 1.7017 0.2917 3.9015 9.2142 1.4299 92.4037 8.4450 46.1276 0.3578 3.0930 3.1991 3.8997 0.5908 4.3112 1.1190 13.4800 14.6522 31.4592 66.8551 56.0511 0.0042 0.8180 0.0644 40.3921 5.1015 39.4898 30.8773 8.5384 5.5821 108.5019 339.8091 43.8737 22.1627 222.8474 0.5596 8.6648 18.0712 54.8817 72.9139 45.5695 10.9412 1.4077 10.1718 18.6546 41.8319
temp: 298.150 k
press: 1.00000 atm
elementType: 16 8 8 8 7 6 6 6 6 6 6 6 6 1 1 1 1 1
symmnumber: 1
zpe: 305777.3 jmol-1
zpe.correction: 0.116464 hartree
zpe.thermalcorrener: 0.127234 hartree
zpe.thermalcorrenthalpy: 0.128178 hartree
zpe.thermalcorrgfe: 0.079591 hartree
zpe.sumelectzpe: -985.317900 hartree
zpe.sumelectthermal: -985.307130 hartree
zpe.sumelectthermalent: -985.306186 hartree
zpe.sumelectthermalfe: -985.354774 hartree
dipole: -8.4198 1.5304 -0.0018
dipole: 8.5578
quadrupole: -90.2252 -72.2472 -83.7405
quadrupole: -1.9791 -0.0084 0.0016
quadrupole: -8.1542 9.8238 -1.6696 -1.9791 -0.0084 0.0016
hfenergy: -985.4343648 hartree
pointgroup: C01 [X(C8H5N1O3S1)]
dipole: 3.3024023 -0.6557866 -0.0007182 debye
dipolederiv: -0.1607573 0.0410124 -0.0000309 0.0954495 -0.0977159 0.0000391 -0.0000703 0.0000084 0.1501275 -0.0759774 -0.2467398 0.0000155 0.0100754 -1.2160019 -0.0000157 -0.0000342 0.0000602 -0.3455294 -0.8380821 -0.1841232 -0.0000031 -0.3904056 -0.5318514 -0.000235 0.000654 0.0004653 -0.2140668 -0.756725 0.1958784 -0.0000343 0.2814235 -0.723643 0.0002841 0.000384 -0.0004022 -0.2420735 2.1032734 -0.2270442 -0.0001906 -0.0119256 1.0092019 -0.0000183 -0.0005446 -0.0000685 0.2218496 -0.2199397 -0.3161045 0.0000123 0.0487256 -0.3002391 0.0000225 -0.0000067 -0.0000055 0.0298439 0.4082778 -0.3057955 0.000107 -0.231569 0.0799306 -0.0000386 -0.0000099 -0.00001 -0.0962301 0.577903 0.3369049 -0.0000208 -0.2665851 1.0878579 0.0000532 -0.0001341 -0.000065 0.1378614 -1.150425 0.4793183 0.000185 0.5031291 0.1365586 -0.0001186 -0.0003116 0.0000092 -0.1285389 0.1222483 0.1187574 -0.0000028 -0.0561737 0.0721822 -0.0000073 0.0000811 -0.0000025 -0.1454394 -0.2329123 0.1388102 -0.0000166 0.1495174 0.1030605 -0.0000252 -0.00001 -0.00001 -0.1055535 -0.02229 -0.1659045 0.0000339 -0.2057283 -0.0823514 -0.0000017 0.0000268 -0.0000154 -0.1520356 0.0414786 0.0336471 0.0000148 0.026651 0.1310204 -0.0000317 0.000024 -0.0000273 -0.144408 0.081223 -0.0780078 -0.000001 -0.0176308 -0.1135102 0.0000238 -0.0000002 0.0000257 0.1595743 0.0892085 0.0208396 -0.0000061 -0.0407753 -0.0453597 0.000023 -0.0000058 0.0000278 0.1640342 -0.0459888 0.0860516 -0.0000208 0.097224 0.0244118 0.0000199 -0.0000297 0.0000153 0.1668995 -0.0757778 -0.067588 -0.0000068 -0.0647463 0.0652364 0.0000078 -0.0000127 0.000003 0.1648215 0.1552629 0.1400876 -0.0000347 0.0733442 0.4012122 0.0000189 0. -0.0000086 0.3788634 unknown
polarizability: 205.570058|-9.6293544|136.5169505|-0.0084795|-0.0093161|44.3704816 unknown
InChI: InChI=1S/C8H5NO3S/c10-7-5-3-1-2-4-6(5)13-8(7)9(11)12/h1-4,10H
charge 0 multiplicity 1
18 atoms
S  -0.534822 1.811957 -0.000425
O  -0.971857 -2.203239 0.000022
O  -3.462781 -0.907078 0.000839
O  -3.395366 1.392728 0.000605
N  -2.826378 0.219309 -0.000438
C  0.872178 -0.501637 -0.000062
C  1.043287 0.916956 -0.000199
C  -0.531079 -0.894165 -0.000113
C  -1.390269 0.204382 -0.000319
C  2.017606 -1.343907 0.000103
C  2.326619 1.500642 -0.000175
C  3.29832 -0.765896 0.000131
C  3.451183 0.649581 -0.000008
H  1.920484 -2.438197 0.00021
H  2.451298 2.588049 -0.000288
H  4.185695 -1.406568 0.000261
H  4.455735 1.085156 0.000012
H  -0.205053 -2.832371 0.000146
