program: Gaussian 09
title: 000298568
version: EM64L-G09RevD.01
frameworkgroup: C1[X(C18H20O3S)]
method: RPBEPBE
basis: SDD
operation: Freq
keyword: #p
keyword: freq=noraman
keyword: PBEPBE/SDD
title: #p freq=noraman PBEPBE/SDD
converged: NO YES NO NO
title: Mulliken charges:
elementType: S O O O C C C C C C C C C C C C C C C C C C H H H H H H H H H H H H H H H H H H H H
charge: 0.910985 -0.482890 -0.585347 -0.536445 -0.496421 0.048270 -0.383836 -0.578360 -0.391236 -0.357982 0.402470 0.374869 -0.360885 -0.392233 -0.381777 -0.366284 -0.255265 -0.227229 -0.225592 -0.249526 -0.242284 -0.239074 0.286266 0.250854 0.252832 0.266914 0.298575 0.225250 0.197107 0.229429 0.239026 0.371938 0.226107 0.296993 0.273654 0.243219 0.225821 0.226695 0.223743 0.226250 0.226831 0.228568
chargesum: 0.00000
title: Mulliken charges with hydrogens summed into heavy atoms:
elementType: S O O O C C C C C C C C C C C C C C C C C C
charge: 0.910985 -0.110952 -0.585347 -0.536445 -0.210154 0.048270 0.119850 -0.012870 0.031120 0.110473 0.402470 0.374869 -0.134778 -0.095240 -0.108124 -0.123065 -0.029444 -0.000534 -0.001849 -0.023275 -0.015454 -0.010506
polarizability: 2.32026946e+02 -9.87642068e+00 2.44373235e+02 3.03061762e+00 -1.06920515e+01 1.90979236e+02
1716.lowfreq: -5.4264 -0.0022 -0.0017 0.0003 4.8599 11.3085 37.3220 43.9654 46.7615
frequency: 37.0206 43.9451 46.6977 60.5515 71.2393 75.7750 104.8501 144.0644 165.3872 184.0078 197.2012 219.3762 245.2007 252.0895 276.2853 280.6669 314.3681 331.4064 341.2558 362.4684 369.0950 395.0741 402.8354 405.9929 445.1141 457.7836 482.9800 523.9313 547.5077 580.5079 615.4177 616.4938 634.1442 645.0020 700.7790 707.5487 723.8083 751.1889 757.9416 770.9414 778.8377 810.4477 812.3673 851.1294 857.8279 872.3411 885.6872 898.3439 911.2565 926.1529 937.1803 947.9850 972.7070 977.2040 982.4761 989.7816 991.1429 998.2900 1002.4531 1015.4652 1026.8965 1031.7226 1044.5598 1067.9641 1080.8650 1097.0902 1100.3730 1118.9076 1151.8440 1163.8539 1172.0001 1172.6111 1179.5159 1189.6151 1193.9576 1200.3619 1229.6349 1250.9657 1269.4383 1292.5888 1310.2874 1320.3620 1343.6450 1352.6098 1355.9384 1378.0595 1382.2762 1417.4700 1426.3415 1435.5913 1448.9956 1450.5403 1466.2325 1469.1545 1476.3752 1480.6269 1590.0322 1592.4453 1606.2325 1612.1376 2975.4875 2985.9864 2992.6497 3037.4311 3044.1482 3049.2731 3056.7811 3069.6967 3090.4244 3122.1055 3124.4065 3130.7089 3131.2984 3133.6351 3143.1495 3146.2876 3158.9788 3159.7711 3169.9261 3178.5268
redmass: 5.2536 5.4801 4.1198 4.6994 3.2837 4.4954 3.4305 3.5253 8.8375 5.2651 5.8296 5.7342 4.1457 3.8279 4.6556 5.3629 4.1628 2.9637 3.4434 5.6950 5.7363 4.9755 2.9132 3.1278 4.6315 3.0964 2.5567 3.3663 3.6251 3.8232 6.4072 6.4199 5.6275 4.8057 1.8042 1.7832 3.4845 2.6303 1.9316 1.8211 1.8254 1.6347 2.7351 1.2501 1.2497 1.6490 3.3788 4.4632 2.2504 1.6032 1.7393 2.4163 2.4599 1.4195 1.4322 5.6996 4.9987 1.3291 1.3797 2.9031 2.2118 2.1796 2.1951 1.4958 1.5717 1.5980 1.3890 2.1367 1.8543 1.8144 1.1170 1.0645 1.3250 1.2514 1.1986 2.0266 1.5957 1.2612 1.2457 1.2031 1.3483 1.3372 1.3769 1.4949 1.4048 7.3129 7.7988 1.1079 1.8294 2.2148 1.4002 1.0830 1.0801 1.0863 2.1821 2.1828 6.1626 6.1669 6.0384 6.0838 1.0642 1.0626 1.0628 1.0708 1.0892 1.0926 1.0937 1.0908 1.0692 1.0847 1.0845 1.0883 1.1096 1.0880 1.0939 1.0931 1.0965 1.0988 1.0991 1.0951
irintensity: 3.2279 2.3467 0.3789 0.6222 0.1005 0.4813 0.6361 1.1039 12.6903 0.6244 3.0965 1.7157 2.1019 1.7492 4.3067 6.5107 13.1655 6.5534 18.2107 10.1473 14.1515 21.5043 0.3821 3.7886 3.3759 2.0501 1.4352 3.5417 50.4910 13.3483 0.0721 0.0996 8.1795 4.5297 29.6027 83.6228 4.2219 150.6813 97.2615 73.8365 2.4744 15.5384 1.0106 4.0604 0.3002 18.8510 17.0591 58.6668 10.3200 2.2901 7.0029 17.6087 8.8882 0.1827 0.7361 1.1316 0.2454 0.1611 3.6301 18.4039 11.3049 5.9211 24.1360 6.2592 1.9237 1.6106 5.8373 1.8733 7.3791 10.3239 1.3093 1.3018 5.7499 6.5144 0.7487 14.2246 9.1032 10.7989 26.7594 0.7208 1.3186 3.4323 3.0089 1.1421 3.9956 1.2800 0.8889 10.7012 10.3505 8.2510 88.8263 10.9921 10.0806 15.6495 23.1695 10.1585 0.0955 1.0842 6.1583 0.9693 28.3024 28.1957 11.4273 8.6188 17.8055 12.4144 10.8224 23.7911 314.1388 1.9053 1.3787 5.1581 1.7180 11.3887 28.0329 43.7749 19.3876 26.6090 13.7168 8.6884
temp: 298.150 k
press: 1.00000 atm
elementType: 16 8 8 8 6 6 6 6 6 6 6 6 6 6 6 6 6 6 6 6 6 6 1 1 1 1 1 1 1 1 1 1 1 1 1 1 1 1 1 1 1 1
symmnumber: 1
zpe: 882591.7 jmol-1
zpe.correction: 0.336161 hartree
zpe.thermalcorrener: 0.356351 hartree
zpe.thermalcorrenthalpy: 0.357295 hartree
zpe.thermalcorrgfe: 0.287359 hartree
zpe.sumelectzpe: -1319.883476 hartree
zpe.sumelectthermal: -1319.863287 hartree
zpe.sumelectthermalent: -1319.862343 hartree
zpe.sumelectthermalfe: -1319.932279 hartree
dipole: -0.9715 -5.0802 -3.0392
dipole: 5.9991
quadrupole: -126.4562 -133.2680 -136.2641
quadrupole: 13.7307 3.4564 0.4502
quadrupole: 5.5399 -1.2719 -4.2680 13.7307 3.4564 0.4502
hfenergy: -1320.2196378 hartree
pointgroup: C01 [X(C18H20O3S1)]
dipole: 0.1229115 2.132181 1.0046829 debye
polarizability: 237.4082131|11.0141479|236.7897954|-6.7653992|-13.868294|193.1814078 unknown
InChI: InChI=1S/C18H20O3S/c19-18(15-9-3-1-4-10-15,16-11-5-2-6-12-16)17-13-7-8-14-22(17,20)21/h1-6,9-12,17,19H,7-8,13-14H2
charge 0 multiplicity 1
42 atoms
S  -2.676027 0.033302 0.067721
O  -0.065907 0.095323 -1.830562
O  -2.724207 -0.298116 -1.559926
O  -3.055953 -1.118092 1.161308
C  -0.85981 0.847312 0.374637
C  0.193065 -0.028684 -0.395459
C  -0.893261 2.309524 -0.102866
C  -3.943669 1.463909 0.370821
C  -2.058462 3.191785 0.403634
C  -3.430382 2.789323 -0.187594
C  0.221179 -1.517735 0.026109
C  1.580195 0.611287 -0.129742
C  -0.096243 -1.971974 1.329825
C  2.266252 1.275812 -1.173742
C  0.668633 -2.459844 -0.93496
C  2.165632 0.552032 1.159991
C  0.030006 -3.338609 1.663814
C  3.52533 1.870363 -0.930648
C  0.795826 -3.824218 -0.601619
C  3.418144 1.156314 1.403644
C  0.478868 -4.270229 0.702613
C  4.103557 1.818917 0.358485
H  -0.783216 0.754074 1.471256
H  -0.867709 2.313936 -1.208169
H  0.064004 2.756609 0.229325
H  -4.05957 1.45343 1.467023
H  -4.848822 1.075194 -0.123623
H  -1.83847 4.23635 0.115033
H  -2.107147 3.175217 1.51219
H  -4.188601 3.563152 0.04593
H  -3.364473 2.730273 -1.290808
H  -1.026308 -0.200172 -1.985757
H  -0.474198 -1.287037 2.095714
H  1.8053 1.301496 -2.164401
H  0.906831 -2.105518 -1.942373
H  1.665763 0.007758 1.969299
H  -0.239807 -3.674474 2.671067
H  4.054435 2.373024 -1.748355
H  1.139137 -4.538885 -1.358136
H  3.863889 1.09959 2.403164
H  0.571295 -5.330736 0.962618
H  5.0793 2.281219 0.54582
