program: Gaussian 09
title: 000298573
version: EM64L-G09RevD.01
frameworkgroup: C1[X(C20H18OS)]
method: RPBEPBE
basis: SDD
operation: Freq
keyword: #p
keyword: freq=noraman
keyword: PBEPBE/SDD
title: #p freq=noraman PBEPBE/SDD
converged: YES YES NO NO
title: Mulliken charges:
elementType: S O C C C C C C C C C C C C C C C C C C C C H H H H H H H H H H H H H H H H H H
charge: 0.243188 -0.452985 0.071252 -0.837081 0.370981 0.398843 -0.361525 -0.395767 -0.404432 -0.359428 -0.228717 -0.234623 -0.247373 -0.226155 -0.195968 -0.239684 -0.242250 -0.234688 -0.256678 -0.215924 -0.214104 -0.232134 0.270548 0.273710 0.273599 0.248139 0.239123 0.273236 0.352509 0.227311 0.223022 0.225777 0.223204 0.229552 0.225513 0.251524 0.263619 0.230436 0.232670 0.231758
chargesum: 0.00000
title: Mulliken charges with hydrogens summed into heavy atoms:
elementType: S O C C C C C C C C C C C C C C C C C C C C
charge: 0.243188 -0.100476 0.071252 -0.292823 0.370981 0.398843 -0.087926 -0.147628 -0.165309 -0.086192 -0.001406 -0.011601 -0.021596 -0.002951 -0.195968 -0.010131 -0.016736 0.016836 0.006941 0.014512 0.018566 -0.000375
polarizability: 2.55477253e+02 -1.03183821e+01 2.36568737e+02 -2.47685064e+01 -1.87401602e+01 1.88662022e+02
1716.lowfreq: -14.3624 -7.5321 0.0014 0.0018 0.0020 5.7438 9.1451 20.5765 30.9865
frequency: 0.9769 19.3153 30.6573 34.1468 39.4494 56.9363 84.9270 118.4202 153.8318 188.3494 214.4144 255.1719 269.5351 271.3382 288.7189 297.0443 329.0723 350.5787 391.9775 400.5497 402.6643 403.8384 433.1882 476.6727 493.5208 533.1751 586.4203 611.2864 614.8232 616.3601 623.8313 677.5623 690.7457 695.9690 704.1294 705.6291 710.9853 754.2707 763.7728 776.5662 828.4444 850.0585 853.5659 856.5501 912.2831 921.7823 924.7172 936.6006 968.7794 975.9670 978.5493 980.0929 986.6542 989.7139 990.6861 994.7606 995.9853 998.5695 1015.2696 1025.7496 1029.3293 1038.0427 1070.6867 1074.7532 1082.8707 1095.8231 1151.5989 1171.0176 1171.3872 1172.0725 1174.2084 1181.2143 1187.8226 1190.0366 1193.9876 1265.1220 1299.0041 1313.6713 1319.2210 1332.9273 1371.4570 1378.1802 1382.1958 1422.7876 1425.3350 1432.9898 1434.4287 1458.1603 1479.0675 1480.9381 1584.4774 1586.8453 1589.0131 1592.1483 1608.5577 1612.6290 3015.6100 3096.8322 3120.3274 3122.9450 3126.4975 3129.0947 3131.7064 3135.1007 3141.9371 3144.5467 3147.6319 3156.0890 3158.8250 3159.5708 3167.1696 3171.0941 3186.3241 3550.5517
redmass: 3.8626 4.1352 4.9933 3.9513 5.3876 5.4392 5.6962 5.6310 3.8109 4.6569 4.4178 5.0839 6.0002 4.7301 4.3736 1.2269 3.2054 4.8109 7.5672 2.8108 2.8563 2.9113 4.4375 3.7249 3.2119 3.9553 3.5104 6.4520 6.4140 6.4016 6.2353 6.6044 5.6990 2.2518 1.8904 1.6985 4.3321 1.5205 1.8488 2.1528 2.6094 1.2519 1.2490 1.2454 1.9754 1.4862 1.3933 2.1215 2.3371 1.4577 1.4020 1.4156 5.3420 6.0011 5.8858 1.3257 1.3176 1.3228 3.3337 2.6245 2.1438 3.3788 1.5933 2.4039 1.5860 1.7635 2.0949 1.0581 1.0543 1.0639 1.1026 1.1206 2.1434 1.3338 1.1202 1.2577 1.3223 1.4254 1.3376 1.6127 9.2973 7.9797 8.8487 1.2656 1.6961 2.2100 2.1962 2.0962 2.1751 2.2592 6.2729 6.0304 6.0510 6.3412 6.0391 6.0697 1.0585 1.1051 1.0846 1.0845 1.0848 1.0884 1.0880 1.0885 1.0940 1.0929 1.0937 1.0957 1.0996 1.0968 1.1002 1.1000 1.0945 1.0659
irintensity: 0.1334 0.2559 0.0662 0.0851 0.5052 0.1513 0.2290 0.1763 4.1807 1.2390 2.0409 0.4463 1.1624 2.3862 12.1794 175.9590 34.6412 17.2578 1.8852 1.4591 0.1426 0.2146 11.4437 2.0112 10.6776 6.6393 20.7581 0.1213 1.3392 0.1581 26.3555 6.3019 18.0221 29.9995 46.3107 54.8214 29.9216 74.4974 50.6689 24.0126 7.7624 0.2648 0.1045 0.1016 12.9698 4.6699 3.1293 5.1676 46.8716 1.6761 1.2622 2.3457 2.5331 0.5978 0.4647 0.4738 0.1274 0.1252 16.5873 6.0181 12.7193 11.9754 9.9685 2.2561 1.5287 5.6436 21.9422 0.1428 0.0410 1.2865 7.0725 3.8483 10.9387 1.8820 1.3649 7.4809 1.2470 1.4946 1.6267 25.9433 0.7631 0.4101 0.9519 0.4129 16.1982 7.6024 15.3572 32.4178 18.1503 17.5029 1.5333 13.1354 1.6420 0.4022 6.7192 2.3014 16.5807 9.7410 1.2452 2.1902 0.7979 4.8391 6.4534 4.3813 32.8112 30.2647 22.0161 21.9644 41.6105 21.5943 17.3772 11.9723 4.9163 5.8256
temp: 298.150 k
press: 1.00000 atm
elementType: 16 8 6 6 6 6 6 6 6 6 6 6 6 6 6 6 6 6 6 6 6 6 1 1 1 1 1 1 1 1 1 1 1 1 1 1 1 1 1 1
symmnumber: 1
zpe: 833028.3 jmol-1
zpe.correction: 0.317284 hartree
zpe.thermalcorrener: 0.336908 hartree
zpe.thermalcorrenthalpy: 0.337852 hartree
zpe.thermalcorrgfe: 0.263073 hartree
zpe.sumelectzpe: -1244.656734 hartree
zpe.sumelectthermal: -1244.637109 hartree
zpe.sumelectthermalent: -1244.636165 hartree
zpe.sumelectthermalfe: -1244.710944 hartree
dipole: -0.4217 2.7479 -0.1664
dipole: 2.7850
quadrupole: -125.2580 -129.1837 -130.0624
quadrupole: -3.8716 -7.1590 -6.0106
quadrupole: 2.9101 -1.0157 -1.8944 -3.8716 -7.1590 -6.0106
hfenergy: -1244.9740173 hartree
pointgroup: C01 [X(C20H18O1S1)]
dipole: 0.0793154 1.0928431 0.0000372 debye
polarizability: 252.7094571|10.386079|240.1085918|-28.0334701|13.5036988|187.8899635 unknown
InChI: InChI=1S/C20H18OS/c21-20(17-10-4-1-5-11-17,18-12-6-2-7-13-18)16-22-19-14-8-3-9-15-19/h1-15,21H,16H2
charge 0 multiplicity 1
40 atoms
S  1.792452 -1.135192 1.327753
O  0.250872 -0.05281 -1.211875
C  -0.564609 -0.015082 0.022347
C  0.366977 0.113478 1.267737
C  -1.537437 1.187013 -0.060621
C  -1.328985 -1.351497 0.059572
C  -2.152325 1.4582 -1.311707
C  -2.506229 -1.481875 0.838089
C  -1.859608 2.011735 1.046773
C  -0.829159 -2.482378 -0.630252
C  -3.060458 2.527746 -1.452924
C  -3.172485 -2.723944 0.92795
C  -2.76964 3.085831 0.905853
C  -1.501352 -3.722588 -0.546896
C  3.104639 -0.1768 0.442001
C  -3.373354 3.348569 -0.342966
C  -2.672249 -3.850344 0.234426
C  3.742732 0.914848 1.079267
C  3.514033 -0.583832 -0.850077
C  4.779408 1.610406 0.414508
C  4.563724 0.104029 -1.503488
C  5.193767 1.204311 -0.876008
H  -0.20224 -0.066632 2.194473
H  0.823524 1.118027 1.316261
H  -1.904524 0.820421 -2.166199
H  -2.917252 -0.609241 1.358931
H  -1.409778 1.830308 2.028845
H  0.077256 -2.372367 -1.229568
H  0.839466 0.745247 -1.22805
H  -3.525784 2.721791 -2.426003
H  -4.084076 -2.809712 1.53028
H  -3.005261 3.714219 1.772367
H  -1.10725 -4.59021 -1.088426
H  -4.078347 4.180414 -0.451231
H  -3.191136 -4.813525 0.299676
H  3.441616 1.203247 2.092595
H  3.007755 -1.42435 -1.334284
H  5.270829 2.455244 0.909901
H  4.881219 -0.21542 -2.502334
H  6.003766 1.737915 -1.385691
