program: Gaussian 09
title: 000298570
version: EM64L-G09RevD.01
frameworkgroup: C1[X(C18H18O2S)]
method: RPBEPBE
basis: SDD
operation: Freq
keyword: #p
keyword: freq=noraman
keyword: PBEPBE/SDD
title: #p freq=noraman PBEPBE/SDD
converged: YES YES NO NO
title: Mulliken charges:
elementType: S O O C C C C C C C C C C C C C C C C C C H H H H H H H H H H H H H H H H H H
charge: 0.859099 -0.549442 -0.573662 -0.551465 -0.550896 -0.386258 -0.411972 -0.156632 0.276309 0.301856 0.274163 -0.378289 -0.389401 -0.393243 -0.399332 -0.228728 -0.222993 -0.227061 -0.234108 -0.239862 -0.241903 0.264353 0.258965 0.290859 0.257898 0.219313 0.219382 0.258503 0.232893 0.246196 0.261376 0.286290 0.243810 0.225558 0.232061 0.232773 0.231127 0.228974 0.233489
chargesum: 0.00000
title: Mulliken charges with hydrogens summed into heavy atoms:
elementType: S O O C C C C C C C C C C C C C C C C C C
charge: 0.859099 -0.549442 -0.573662 -0.028147 -0.002140 0.052437 0.079424 -0.156632 0.276309 0.301856 0.274163 -0.132093 -0.128025 -0.106954 -0.155522 -0.003170 0.009069 0.005712 -0.002981 -0.010888 -0.008414
polarizability: 2.64124123e+02 -5.18315798e-02 2.64729125e+02 -9.46091607e+00 -9.45224182e+00 1.58050821e+02
1716.lowfreq: -13.3822 -11.5134 -4.0727 -0.0016 -0.0015 -0.0011 32.0507 34.9168 46.3187
frequency: 31.8289 34.6920 46.2322 60.1412 70.1582 73.4133 99.6418 149.7596 155.7127 181.4417 203.1234 227.7210 242.2902 254.9862 276.3338 298.7180 322.9936 345.8474 381.4448 400.3951 405.2952 408.2004 423.1808 460.4871 479.5712 543.0602 564.0788 605.5715 612.7793 617.4873 632.1588 670.0958 698.5796 702.7950 709.4873 760.3729 777.2312 783.6652 791.3736 820.1718 852.6855 857.2032 875.1373 898.1973 910.2585 925.1930 929.8674 940.5593 965.9421 979.4582 980.7986 988.5369 989.8079 999.1460 999.9979 1022.4844 1030.5120 1030.7562 1055.8901 1081.5222 1089.9794 1101.6990 1123.4859 1166.9423 1173.5692 1174.3143 1180.8825 1189.8800 1201.2312 1218.1725 1239.9083 1264.4354 1281.9479 1307.9079 1316.2658 1329.6494 1336.4897 1352.1431 1372.6138 1377.7793 1422.4898 1431.3768 1434.9854 1455.2048 1461.0039 1473.8540 1477.3084 1483.3708 1580.2241 1581.4885 1603.9051 1607.4997 1615.8968 2963.0665 2984.3207 2993.9035 3032.5454 3048.5005 3053.3768 3060.2426 3124.5329 3126.2672 3128.7530 3133.6796 3139.2415 3143.8961 3145.5530 3151.3577 3153.6036 3165.8109 3167.2768
redmass: 3.9808 4.6285 5.2732 4.5940 4.5327 4.3691 3.9843 5.6281 7.8063 5.4944 2.9129 4.7602 5.0996 3.1049 4.7596 4.2781 2.5934 4.8626 5.8238 3.9027 3.8085 2.9897 3.3269 3.4714 4.2036 5.1779 3.3420 4.2858 6.0963 5.4329 5.0104 5.5509 1.9047 2.1358 1.8970 1.7138 2.1697 9.0194 1.9179 2.7110 1.2683 1.2480 2.6385 3.6533 3.4358 1.5547 1.5165 1.9188 2.1573 1.4841 1.4542 4.1766 5.3067 1.3504 1.3684 2.3010 1.7846 2.0823 2.0563 1.6008 1.6336 1.7791 1.6230 1.3563 1.0543 1.0697 2.4235 1.1143 1.1274 1.4709 1.2616 1.2452 3.0491 1.2938 1.3794 1.4011 1.4021 1.4282 6.4353 6.9418 1.1060 2.2186 2.2998 1.0819 1.0738 1.1147 2.1076 2.2496 5.8737 5.7639 6.4727 6.2701 8.1834 1.0668 1.0598 1.0636 1.0961 1.0893 1.0686 1.0977 1.0854 1.0848 1.0892 1.0876 1.0922 1.1107 1.0922 1.0962 1.0964 1.1016 1.1015
irintensity: 0.1245 1.7410 5.1233 0.1841 0.2959 0.6162 1.0702 2.7456 3.8763 0.8687 1.5652 0.7568 3.8202 1.1703 14.5713 2.6427 6.4753 39.2226 8.8721 7.9019 4.3418 1.0627 2.6379 3.1090 3.0443 61.1784 12.9277 6.1047 1.2768 2.8893 7.0291 10.7092 31.4956 48.2848 45.5831 44.5501 36.3883 70.5580 10.3017 2.2592 2.9069 1.9752 24.1906 2.5181 50.3082 9.7079 1.0190 7.6061 11.6370 1.4007 0.4752 1.7914 1.0699 0.1572 0.9870 9.1709 4.7734 9.2300 3.1968 8.3292 7.9824 2.0954 4.2929 1.7997 0.0804 0.2261 0.6836 1.7166 1.9563 8.4723 11.7679 4.5942 17.3737 2.0366 2.5532 2.5078 1.7479 0.5481 1.0337 0.1128 10.6864 10.9479 10.8002 6.2061 27.4042 11.5924 9.3231 9.1310 2.2069 1.7020 2.3003 7.6353 12.7142 8.0478 16.8047 47.9382 15.3677 13.5733 5.0260 41.1448 0.5105 1.6027 3.1291 1.0839 9.8382 2.2515 16.2358 25.2416 28.5988 34.1204 22.0646
temp: 298.150 k
press: 1.00000 atm
elementType: 16 8 8 6 6 6 6 6 6 6 6 6 6 6 6 6 6 6 6 6 6 1 1 1 1 1 1 1 1 1 1 1 1 1 1 1 1 1 1
symmnumber: 1
zpe: 812146.6 jmol-1
zpe.correction: 0.309330 hartree
zpe.thermalcorrener: 0.328532 hartree
zpe.thermalcorrenthalpy: 0.329477 hartree
zpe.thermalcorrgfe: 0.260785 hartree
zpe.sumelectzpe: -1243.541786 hartree
zpe.sumelectthermal: -1243.522583 hartree
zpe.sumelectthermalent: -1243.521639 hartree
zpe.sumelectthermalfe: -1243.590331 hartree
dipole: -3.5820 -5.0417 0.5523
dipole: 6.2092
quadrupole: -126.9213 -113.6665 -135.6109
quadrupole: -13.1642 2.1179 -3.5393
quadrupole: -1.5218 11.7331 -10.2113 -13.1642 2.1179 -3.5393
hfenergy: -1243.8511158 hartree
pointgroup: C01 [X(C18H18O2S1)]
dipole: 2.2123005 0.8592283 0.5789653 debye
polarizability: 257.7402469|-0.6040256|264.4816961|28.6683497|4.2162586|164.682126 unknown
InChI: InChI=1S/C18H18O2S/c19-21(20)14-8-7-13-17(21)18(15-9-3-1-4-10-15)16-11-5-2-6-12-16/h1-6,9-12H,7-8,13-14H2
charge 0 multiplicity 1
39 atoms
S  -2.200903 1.525106 -0.478033
O  -2.978312 0.79305 0.762893
O  -2.754264 1.375241 -2.02013
C  0.434389 2.464957 -0.768972
C  -2.198732 3.431764 -0.052772
C  0.329472 3.616157 0.280229
C  -1.069669 3.695636 0.943827
C  -0.293069 1.192438 -0.401375
C  0.18453 -0.059898 -0.120232
C  -0.65333 -1.297656 -0.084371
C  1.657339 -0.244265 0.116457
C  -0.442636 -2.264184 0.937254
C  2.358382 -1.284704 -0.552744
C  -1.626322 -1.55993 -1.087671
C  2.371873 0.584602 1.023134
C  -1.20869 -3.446515 0.976354
C  3.741494 -1.46899 -0.343279
C  -2.383769 -2.749338 -1.050934
C  3.753292 0.391729 1.242182
C  -2.183656 -3.693891 -0.019229
C  4.445428 -0.631343 0.554093
H  1.495557 2.22851 -0.962548
H  0.019174 2.821025 -1.735298
H  -3.209182 3.569782 0.362747
H  -2.088781 3.937013 -1.024473
H  1.097123 3.482373 1.064481
H  0.558229 4.570616 -0.2319
H  -1.153929 2.962247 1.770322
H  -1.219584 4.69246 1.401304
H  0.31029 -2.075527 1.710697
H  1.814636 -1.940352 -1.241265
H  -1.791228 -0.84056 -1.897882
H  1.83156 1.355508 1.583486
H  -1.048525 -4.172665 1.781037
H  4.269256 -2.267888 -0.875701
H  -3.133243 -2.933509 -1.828114
H  4.285467 1.030974 1.955394
H  -2.778044 -4.614121 0.008798
H  5.517478 -0.781653 0.72273
